{"text_format":"1","workbook":"xlsx","n_sheets":8,"sheets":["Dashboard","Dropdown_Jahr","Dropdown_Bundesland","olap_km_bld","olap_bm_auswahl","olap_bm","Landkarte","X_Y"],"not_rendered":{"charts":3,"images":15,"macros":1,"external_links":0,"defined_names":42,"comments":0,"pivot_tables":3},"unopened":[],"bounds":{"document_bytes":16777216,"sheet_cells":100000,"rows_first":2000,"rows_last":500,"rows_between":2000,"halvings":0,"cell_chars":16384,"cell_head_chars":4096},"cells_cut":0,"cells_raw":0,"read":"whole","date_system":"1900"}

{"sheet":"Dashboard","index":0,"n_rows":38,"n_cols":44,"rows_kept":38,"cut":false,"hidden":false,"merged":[[21,1,21,12],[25,0,26,0]]}
[]
[{"$f":"Auswahl_Bundesland & \":\"","v":"Burgenland:"},"KAMMERMITGLIEDER NACH BEZIRKEN",null,null,null,null,null,null,null,null,null,null,null,null,null,null,null,null,null,null,null,null,null,null,null,null,null,null,null,null,null,null,null,null,"bis 2016",null,null,"ab 2013",null,null,null,"bis 2011",2012,"ab 2017"]
["Ergebnisse der Mitgliederstatistik der Wirtschaftskammern Österreichs - Stand: 31.12.",null,null,null,null,null,{"$f":"Auswahl_Jahr","v":2025},null,null,null,null,null,null,null,1,"Beschriftung wegnehmen, da sonst du viele Zahlen",null,null,null,null,null,null,null,null,null,null,"Zeilenbeschriftungen",null,null,1,"Auswahl_Bundesland",null,{"$f":"COUNTA(AG5:AG28)","v":7},10,21,18,{"$f":"COUNTA(AK5:AK17)","v":6},{"$f":"COUNTA(AL5:AL28)","v":14},{"$f":"COUNTA(AM5:AM28)","v":9},4,23,{"$f":"COUNTA(AP5:AP26)","v":20},{"$f":"COUNTA(AQ5:AQ26)","v":17},{"$f":"COUNTA(AR5:AR27)","v":20}]
[null,null,null,null,null,null,null,null,null,null,null,null,null,null,2,"Bundesland einfärben, sonst geht es unter",null,null,null,null,null,null,null,null,null,null,"Burgenland",1,{"$f":"AA4","v":"Burgenland"},1,{"$f":"LOOKUP($AD$4,$AB$4:$AC$12)","v":"Burgenland"},null,"Burgenland","Kärnten","Niederösterreich","Oberösterreich","Salzburg","Steiermark","Tirol","Vorarlberg","Wien","Steiermark","Steiermark","Niederösterreich"]
[null,null,null,null,null,null,null,null,null,null,null,null,null,null,3,"Weniger in Kreisdiagramm",null,null,null,null,null,null,null,null,null,null,"Kärnten",2,"Kärnten",4,{"$f":"IF(AND($AD$5>AG3,Auswahl_Bundesland=\"Burgenland\"),AG5,IF(Auswahl_Bundesland=\"Burgenland\",LOOKUP($AD$5,$AF:$AF,$AG:$AG),IF(AND($AD$5>AH3,Auswahl_Bundesland=\"Kärnten\"),AH5,IF(Auswahl_Bundesland=\"Kärnten\",LOOKUP($AD$5,$AF:$AF,$AH:$AH),IF(AND($AD$5>AI3,Auswahl_Bundesland=\"Niederösterreich\",Auswahl_Jahr<=2016),AI5,IF(AND($AD$5>AR3,Auswahl_Bundesland=\"Niederösterreich\",Auswahl_Jahr>=2017),AR5,IF(AND($AD$5>AJ3,Auswahl_Bundesland=\"Oberösterreich\"),AJ5,IF(AND($AD$5>AK3,Auswahl_Bundesland=\"Salzburg\"),AK5,IF(AND($AD5>AL3,Auswahl_Bundesland=\"Steiermark\",Auswahl_Jahr>2012),AL5,IF(AND($AD$5>AP3,Auswahl_Bundesland=\"Steiermark\",Auswahl_Jahr<2012),AP5,IF(AND($AD$5>AQ3,Auswahl_Bundesland=\"Steiermark\",Auswahl_Jahr=2012),AQ5,IF(AND($AD$5>AM3,Auswahl_Bundesland=\"Tirol\"),AM5,IF(AND($AD$5>AN3,Auswahl_Bundesland=\"Vorarlberg\"),AN5,IF(AND($AD$5>AO3,Auswahl_Bundesland=\"Wien\"),AO5,IF(AND(Auswahl_Bundesland=\"Niederösterreich\",Auswahl_Jahr>=2017),LOOKUP($AD$5,$AF:$AF,$AR:$AR),IF(Auswahl_Bundesland=\"Oberösterreich\",LOOKUP($AD$5,$AF:$AF,$AJ:$AJ),IF(Auswahl_Bundesland=\"Salzburg\",LOOKUP($AD$5,$AF:$AF,$AK:$AK),IF(AND(Auswahl_Bundesland=\"Steiermark\",Auswahl_Jahr>2012),LOOKUP($AD$5,$AF:$AF,$AL:$AL),IF(AND(Auswahl_Bundesland=\"Steiermark\",Auswahl_Jahr<2012),LOOKUP($AD$5,$AF:$AF,$AP:$AP),IF(AND(Auswahl_Bundesland=\"Steiermark\",Auswahl_Jahr=2012),LOOKUP($AD$5,$AF:$AF,$AQ:$AQ),IF(Auswahl_Bundesland=\"Tirol\",LOOKUP($AD$5,$AF:$AF,$AM:$AM),IF(Auswahl_Bundesland=\"Vorarlberg\",LOOKUP($AD$5,$AF:$AF,$AN:$AN),IF(AND(Auswahl_Bundesland=\"Niederösterreich\",Auswahl_Jahr<=2016),LOOKUP($AD$5,$AF:$AF,$AI:$AI),IF(Auswahl_Bundesland=\"Wien\",LOOKUP($AD$5,$AF:$AF,$AO:$AO),\"\"))))))))))))))))))))))))","v":"Oberpullendorf"},1,"Eisenstadt-Umgebung","Feldkirchen","Amstetten","Linz","Salzburg","Graz","Innsbruck","Bludenz","Innere Stadt","Graz","Graz","Amstetten"]
[null,null,null,null,null,null,null,null,null,null,null,null,null,null,4,"Anteil des ausgewählten Bundeslandes anschreiben",null,null,null,null,null,null,null,null,null,null,"Niederösterreich",3,"Niederösterreich",null,null,2,"Neusiedl am See","Hermagor","Baden","Steyr","Hallein","Deutschlandsberg","Imst","Bregenz","Leopoldstadt","Deutschlandsberg","Deutschlandsberg","Baden"]
[null,null,null,null,null,null,null,null,null,null,null,null,null,null,5,"Veränderung für Murtal (neue Bezirke in der Steiermark) korrigieren",null,null,null,null,null,null,null,null,null,null,"Oberösterreich",4,"Oberösterreich",null,null,3,"Mattersburg","Klagenfurt-Land","Bruck an der Leitha","Wels","Salzburg-Umgebung","Graz-Umgebung","Innsbruck Land","Dornbirn","Landstraße","Graz-Umgebung","Graz-Umgebung","Bruck an der Leitha"]
[null,null,null,null,null,null,null,null,null,null,null,null,null,null,6,"Wenn sich Auswahl_Bundesland ändert immer ersten Bezirk auswählen --> nur mit Makro möglich",null,null,null,null,null,null,null,null,null,null,"Salzburg",5,"Salzburg",null,null,4,"Oberpullendorf","Klagenfurt am Wörthersee","Gänserndorf","Braunau am Inn","Sankt Johann im Pongau","Leibnitz","Kitzbühel","Feldkirch","Wieden","Leibnitz","Leibnitz","Gänserndorf"]
{"$rows_left_out":31}
{"sheet":"Dropdown_Jahr","index":1,"n_rows":33,"n_cols":3,"rows_kept":33,"cut":false,"hidden":true,"merged":[]}
[]
[]
["Zeilenbeschriftungen",null,"Auswahl"]
["Jahresstatistik 2001",{"$f":"IF(LEFT(A4,5)=\"Jahre\",RIGHT(A4,4),\"\")","v":"2001"},2025]
["Jahresstatistik 2002",{"$f":"IF(LEFT(A5,5)=\"Jahre\",RIGHT(A5,4),\"\")","v":"2002"}]
["Jahresstatistik 2003","2003"]
["Jahresstatistik 2004","2004"]
["Jahresstatistik 2005","2005"]
{"$rows_left_out":26}
{"sheet":"Dropdown_Bundesland","index":2,"n_rows":27,"n_cols":18,"rows_kept":27,"cut":false,"hidden":true,"merged":[]}
[]
[null,null,null,null,null,null,null,null,"bis 2016",null,null,"ab 2013",null,null,null,"bis 2011",2012,"ab 2017"]
["Zeilenbeschriftungen",null,null,2,"Auswahl_Bundesland",null,{"$f":"COUNTA(G5:G28)","v":7},10,21,18,{"$f":"COUNTA(K5:K17)","v":6},{"$f":"COUNTA(L5:L28)","v":14},{"$f":"COUNTA(M5:M28)","v":9},4,23,{"$f":"COUNTA(P5:P26)","v":20},{"$f":"COUNTA(Q5:Q26)","v":17},{"$f":"COUNTA(R5:R27)","v":20}]
["Burgenland",1,{"$f":"A4","v":"Burgenland"},{"$f":"Dashboard!AD4","v":1},{"$f":"Dashboard!AE4","v":"Burgenland"},null,"Burgenland","Kärnten","Niederösterreich","Oberösterreich","Salzburg","Steiermark","Tirol","Vorarlberg","Wien","Steiermark","Steiermark","Niederösterreich"]
["Kärnten",2,"Kärnten",{"$f":"Dashboard!AD5","v":4},{"$f":"Dashboard!AE5","v":"Oberpullendorf"},1,"Eisenstadt-Umgebung","Feldkirchen","Amstetten","Linz","Salzburg","Graz","Innsbruck","Bludenz","Innere Stadt","Graz","Graz","Amstetten"]
["Niederösterreich",3,"Niederösterreich",null,null,2,"Neusiedl am See","Hermagor","Baden","Steyr","Hallein","Deutschlandsberg","Imst","Bregenz","Leopoldstadt","Deutschlandsberg","Deutschlandsberg","Baden"]
["Oberösterreich",4,"Oberösterreich",null,null,3,"Mattersburg","Klagenfurt-Land","Bruck an der Leitha","Wels","Salzburg-Umgebung","Graz-Umgebung","Innsbruck Land","Dornbirn","Landstraße","Graz-Umgebung","Graz-Umgebung","Bruck an der Leitha"]
["Salzburg",5,"Salzburg",null,null,4,"Oberpullendorf","Klagenfurt am Wörthersee","Gänserndorf","Braunau am Inn","Sankt Johann im Pongau","Leibnitz","Kitzbühel","Feldkirch","Wieden","Leibnitz","Leibnitz","Gänserndorf"]
{"$rows_left_out":20}
{"sheet":"olap_km_bld","index":3,"n_rows":91,"n_cols":43,"rows_kept":91,"cut":false,"hidden":true,"merged":[]}
["Status","Aktiv",1,{"$f":"IF($C$1=1,\"Aktive\",IF($C$1=2,\"Ruhende\",\"Gesamte\"))","v":"Aktive"}]
["Aktiv",2001,2002,2003,2004,2005,2006,2007,2008,2009,2010,2011,2012,2013,2014,2015,2016,2017,2018,2019,2020,2021,2022,2023,2024,2025,{"$error":"#VALUE!"},{"$error":"#VALUE!"},{"$error":"#VALUE!"},{"$error":"#VALUE!"},{"$error":"#VALUE!"},{"$error":"#VALUE!"},{"$error":"#VALUE!"},{"$error":"#VALUE!"},{"$error":"#VALUE!"},{"$error":"#VALUE!"},{"$error":"#VALUE!"},{"$error":"#VALUE!"},{"$error":"#VALUE!"},{"$error":"#VALUE!"},{"$error":"#VALUE!"},{"$error":"#VALUE!"},{"$error":"#VALUE!"}]
["Anzahl Mitglieder","Spaltenbeschriftungen"]
["Zeilenbeschriftungen","Jahresstatistik 2001","Jahresstatistik 2002","Jahresstatistik 2003","Jahresstatistik 2004","Jahresstatistik 2005","Jahresstatistik 2006","Jahresstatistik 2007","Jahresstatistik 2008","Jahresstatistik 2009","Jahresstatistik 2010","Jahresstatistik 2011","Jahresstatistik 2012","Jahresstatistik 2013","Jahresstatistik 2014","Jahresstatistik 2015","Jahresstatistik 2016","Jahresstatistik 2017","Jahresstatistik 2018","Jahresstatistik 2019","Jahresstatistik 2020","Jahresstatistik 2021","Jahresstatistik 2022","Jahresstatistik 2023","Jahresstatistik 2024","Jahresstatistik 2025"]
["Burgenland",9761,10119,10579,11063,11540,11883,12296,13409,14068,15011,15666,16264,16711,17321,17908,18532,18870,19393,19790,20090,20546,20962,21240,21495,21835]
["Kärnten",21147,21678,22305,22809,23487,24199,24889,25591,26217,26639,27425,28325,29561,30916,31565,32559,33112,33964,34446,35292,36330,36751,37491,38265,39384]
["Niederösterreich",54428,56325,58737,61350,63672,65815,68136,73473,76649,80423,83404,86657,90021,93258,96650,99737,102299,103892,105885,107881,111367,112937,114598,116166,118550]
["Oberösterreich",46551,48140,49935,51712,53412,54900,56150,60717,63015,65024,66607,68099,70357,72613,74718,76572,78447,79638,80796,82966,85634,87042,87878,88944,91092]
{"$rows_left_out":84}
{"sheet":"olap_bm_auswahl","index":4,"n_rows":69,"n_cols":28,"rows_kept":69,"cut":false,"hidden":true,"merged":[]}
[{"$f":"IF(Auswahl_Bundesland=\"Burgenland\",Dropdown_Bundesland!$G3,IF(Auswahl_Bundesland=\"Kärnten\",Dropdown_Bundesland!$H3,IF(Auswahl_Bundesland=\"Niederösterreich\",Dropdown_Bundesland!$I3,IF(Auswahl_Bundesland=\"Oberösterreich\",Dropdown_Bundesland!$J3,IF(Auswahl_Bundesland=\"Salzburg\",Dropdown_Bundesland!$K3,IF(AND(Auswahl_Bundesland=\"Steiermark\",Auswahl_Jahr>2012),Dropdown_Bundesland!$L3,IF(AND(Auswahl_Bundesland=\"Steiermark\",Auswahl_Jahr<2012),Dropdown_Bundesland!$P3,IF(AND(Auswahl_Bundesland=\"Steiermark\",Auswahl_Jahr=2012),Dropdown_Bundesland!$Q3,IF(Auswahl_Bundesland=\"Tirol\",Dropdown_Bundesland!$M3,IF(Auswahl_Bundesland=\"Vorarlberg\",Dropdown_Bundesland!$N3,IF(Auswahl_Bundesland=\"Wien\",Dropdown_Bundesland!$O3,\"\")))))))))))","v":7},null,null,7,8,9,10,11,12,13,14,15,16,17,18,19,20,21,22,23,24,25,26,27,28,29,30,31]
[null,null,"Bez_STAT",2001,2002,2003,2004,2005,2006,2007,2008,2009,2010,2011,2012,2013,2014,2015,2016,2017,2018,2019,2020,2021,2022,2023,2024,2025]
[{"$f":"VLOOKUP(Status&Auswahl_Bundesland&C3,matrix_olap_bm,2,FALSE)","v":4},1,{"$f":"IF(Auswahl_Bundesland=\"Burgenland\",LOOKUP(B3,Dropdown_Bundesland!$F:$F,Dropdown_Bundesland!$G:$G),IF(Auswahl_Bundesland=\"Kärnten\",LOOKUP(B3,Dropdown_Bundesland!$F:$F,Dropdown_Bundesland!$H:$H),IF(AND(Auswahl_Bundesland=\"Niederösterreich\",Auswahl_Jahr>=2017),LOOKUP(B3,Dropdown_Bundesland!$F:$F,Dropdown_Bundesland!$R:$R),IF(AND(Auswahl_Bundesland=\"Niederösterreich\",Auswahl_Jahr<=2016),LOOKUP(B3,Dropdown_Bundesland!$F:$F,Dropdown_Bundesland!$I:$I),IF(Auswahl_Bundesland=\"Oberösterreich\",LOOKUP(B3,Dropdown_Bundesland!$F:$F,Dropdown_Bundesland!$J:$J),IF(Auswahl_Bundesland=\"Salzburg\",LOOKUP(B3,Dropdown_Bundesland!$F:$F,Dropdown_Bundesland!$K:$K),IF(AND(Auswahl_Bundesland=\"Steiermark\",Auswahl_Jahr>2012),LOOKUP(B3,Dropdown_Bundesland!$F:$F,Dropdown_Bundesland!$L:$L),IF(AND(Auswahl_Bundesland=\"Steiermark\",Auswahl_Jahr<2012),LOOKUP(B3,Dropdown_Bundesland!$F:$F,Dropdown_Bundesland!$P:$P),IF(AND(Auswahl_Bundesland=\"Steiermark\",Auswahl_Jahr=2012),LOOKUP(B3,Dropdown_Bundesland!$F:$F,Dropdown_Bundesland!$Q:$Q),IF(Auswahl_Bundesland=\"Tirol\",LOOKUP(B3,Dropdown_Bundesland!$F:$F,Dropdown_Bundesland!$M:$M),IF(Auswahl_Bundesland=\"Vorarlberg\",LOOKUP(B3,Dropdown_Bundesland!$F:$F,Dropdown_Bundesland!$N:$N),IF(Auswahl_Bundesland=\"Wien\",LOOKUP(B3,Dropdown_Bundesland!$F:$F,Dropdown_Bundesland!$O:$O),\"\"))))))))))))","v":"Eisenstadt-Umgebung"},{"$f":"IF(ISERROR($A3),0,IF(INDEX(matrix_olap_bm,$A3,D$1)=0,\".\",INDEX(matrix_olap_bm,$A3,D$1)))","v":2241},2344,2442,2589,2703,2745,2818,3116,3286,3521,3627,3677,3801,3870,4007,4054,4095,4181,4289,4311,4498,4506,4542,4618,{"$f":"IF(ISERROR($A3),0,IF(INDEX(matrix_olap_bm,$A3,AB$1)=0,\".\",INDEX(matrix_olap_bm,$A3,AB$1)))","v":4713}]
[{"$f":"VLOOKUP(Status&Auswahl_Bundesland&C4,matrix_olap_bm,2,FALSE)","v":5},2,{"$f":"IF(Auswahl_Bundesland=\"Burgenland\",LOOKUP(B4,Dropdown_Bundesland!$F:$F,Dropdown_Bundesland!$G:$G),IF(Auswahl_Bundesland=\"Kärnten\",LOOKUP(B4,Dropdown_Bundesland!$F:$F,Dropdown_Bundesland!$H:$H),IF(AND(Auswahl_Bundesland=\"Niederösterreich\",Auswahl_Jahr>=2017),LOOKUP(B4,Dropdown_Bundesland!$F:$F,Dropdown_Bundesland!$R:$R),IF(AND(Auswahl_Bundesland=\"Niederösterreich\",Auswahl_Jahr<=2016),LOOKUP(B4,Dropdown_Bundesland!$F:$F,Dropdown_Bundesland!$I:$I),IF(Auswahl_Bundesland=\"Oberösterreich\",LOOKUP(B4,Dropdown_Bundesland!$F:$F,Dropdown_Bundesland!$J:$J),IF(Auswahl_Bundesland=\"Salzburg\",LOOKUP(B4,Dropdown_Bundesland!$F:$F,Dropdown_Bundesland!$K:$K),IF(AND(Auswahl_Bundesland=\"Steiermark\",Auswahl_Jahr>2012),LOOKUP(B4,Dropdown_Bundesland!$F:$F,Dropdown_Bundesland!$L:$L),IF(AND(Auswahl_Bundesland=\"Steiermark\",Auswahl_Jahr<2012),LOOKUP(B4,Dropdown_Bundesland!$F:$F,Dropdown_Bundesland!$P:$P),IF(AND(Auswahl_Bundesland=\"Steiermark\",Auswahl_Jahr=2012),LOOKUP(B4,Dropdown_Bundesland!$F:$F,Dropdown_Bundesland!$Q:$Q),IF(Auswahl_Bundesland=\"Tirol\",LOOKUP(B4,Dropdown_Bundesland!$F:$F,Dropdown_Bundesland!$M:$M),IF(Auswahl_Bundesland=\"Vorarlberg\",LOOKUP(B4,Dropdown_Bundesland!$F:$F,Dropdown_Bundesland!$N:$N),IF(Auswahl_Bundesland=\"Wien\",LOOKUP(B4,Dropdown_Bundesland!$F:$F,Dropdown_Bundesland!$O:$O),\"\"))))))))))))","v":"Neusiedl am See"},1903,2013,2115,2203,2304,2330,2447,2632,2768,2976,3132,3373,3493,3638,3741,3968,4035,4210,4246,4332,4415,4593,4654,4685,4718]
[6,3,{"$f":"IF(Auswahl_Bundesland=\"Burgenland\",LOOKUP(B5,Dropdown_Bundesland!$F:$F,Dropdown_Bundesland!$G:$G),IF(Auswahl_Bundesland=\"Kärnten\",LOOKUP(B5,Dropdown_Bundesland!$F:$F,Dropdown_Bundesland!$H:$H),IF(AND(Auswahl_Bundesland=\"Niederösterreich\",Auswahl_Jahr>=2017),LOOKUP(B5,Dropdown_Bundesland!$F:$F,Dropdown_Bundesland!$R:$R),IF(AND(Auswahl_Bundesland=\"Niederösterreich\",Auswahl_Jahr<=2016),LOOKUP(B5,Dropdown_Bundesland!$F:$F,Dropdown_Bundesland!$I:$I),IF(Auswahl_Bundesland=\"Oberösterreich\",LOOKUP(B5,Dropdown_Bundesland!$F:$F,Dropdown_Bundesland!$J:$J),IF(Auswahl_Bundesland=\"Salzburg\",LOOKUP(B5,Dropdown_Bundesland!$F:$F,Dropdown_Bundesland!$K:$K),IF(AND(Auswahl_Bundesland=\"Steiermark\",Auswahl_Jahr>2012),LOOKUP(B5,Dropdown_Bundesland!$F:$F,Dropdown_Bundesland!$L:$L),IF(AND(Auswahl_Bundesland=\"Steiermark\",Auswahl_Jahr<2012),LOOKUP(B5,Dropdown_Bundesland!$F:$F,Dropdown_Bundesland!$P:$P),IF(AND(Auswahl_Bundesland=\"Steiermark\",Auswahl_Jahr=2012),LOOKUP(B5,Dropdown_Bundesland!$F:$F,Dropdown_Bundesland!$Q:$Q),IF(Auswahl_Bundesland=\"Tirol\",LOOKUP(B5,Dropdown_Bundesland!$F:$F,Dropdown_Bundesland!$M:$M),IF(Auswahl_Bundesland=\"Vorarlberg\",LOOKUP(B5,Dropdown_Bundesland!$F:$F,Dropdown_Bundesland!$N:$N),IF(Auswahl_Bundesland=\"Wien\",LOOKUP(B5,Dropdown_Bundesland!$F:$F,Dropdown_Bundesland!$O:$O),\"\"))))))))))))","v":"Mattersburg"},1386,1419,1459,1494,1579,1647,1702,1818,1919,2026,2025,2068,2116,2219,2250,2322,2352,2413,2435,2487,2554,2598,2600,2662,2751]
[7,4,{"$f":"IF(Auswahl_Bundesland=\"Burgenland\",LOOKUP(B6,Dropdown_Bundesland!$F:$F,Dropdown_Bundesland!$G:$G),IF(Auswahl_Bundesland=\"Kärnten\",LOOKUP(B6,Dropdown_Bundesland!$F:$F,Dropdown_Bundesland!$H:$H),IF(AND(Auswahl_Bundesland=\"Niederösterreich\",Auswahl_Jahr>=2017),LOOKUP(B6,Dropdown_Bundesland!$F:$F,Dropdown_Bundesland!$R:$R),IF(AND(Auswahl_Bundesland=\"Niederösterreich\",Auswahl_Jahr<=2016),LOOKUP(B6,Dropdown_Bundesland!$F:$F,Dropdown_Bundesland!$I:$I),IF(Auswahl_Bundesland=\"Oberösterreich\",LOOKUP(B6,Dropdown_Bundesland!$F:$F,Dropdown_Bundesland!$J:$J),IF(Auswahl_Bundesland=\"Salzburg\",LOOKUP(B6,Dropdown_Bundesland!$F:$F,Dropdown_Bundesland!$K:$K),IF(AND(Auswahl_Bundesland=\"Steiermark\",Auswahl_Jahr>2012),LOOKUP(B6,Dropdown_Bundesland!$F:$F,Dropdown_Bundesland!$L:$L),IF(AND(Auswahl_Bundesland=\"Steiermark\",Auswahl_Jahr<2012),LOOKUP(B6,Dropdown_Bundesland!$F:$F,Dropdown_Bundesland!$P:$P),IF(AND(Auswahl_Bundesland=\"Steiermark\",Auswahl_Jahr=2012),LOOKUP(B6,Dropdown_Bundesland!$F:$F,Dropdown_Bundesland!$Q:$Q),IF(Auswahl_Bundesland=\"Tirol\",LOOKUP(B6,Dropdown_Bundesland!$F:$F,Dropdown_Bundesland!$M:$M),IF(Auswahl_Bundesland=\"Vorarlberg\",LOOKUP(B6,Dropdown_Bundesland!$F:$F,Dropdown_Bundesland!$N:$N),IF(Auswahl_Bundesland=\"Wien\",LOOKUP(B6,Dropdown_Bundesland!$F:$F,Dropdown_Bundesland!$O:$O),\"\"))))))))))))","v":"Oberpullendorf"},1373,1340,1402,1470,1498,1574,1580,1735,1794,1894,2011,2061,2067,2182,2230,2317,2297,2355,2399,2486,2536,2626,2669,2692,2785]
[8,5,{"$f":"IF(Auswahl_Bundesland=\"Burgenland\",LOOKUP(B7,Dropdown_Bundesland!$F:$F,Dropdown_Bundesland!$G:$G),IF(Auswahl_Bundesland=\"Kärnten\",LOOKUP(B7,Dropdown_Bundesland!$F:$F,Dropdown_Bundesland!$H:$H),IF(AND(Auswahl_Bundesland=\"Niederösterreich\",Auswahl_Jahr>=2017),LOOKUP(B7,Dropdown_Bundesland!$F:$F,Dropdown_Bundesland!$R:$R),IF(AND(Auswahl_Bundesland=\"Niederösterreich\",Auswahl_Jahr<=2016),LOOKUP(B7,Dropdown_Bundesland!$F:$F,Dropdown_Bundesland!$I:$I),IF(Auswahl_Bundesland=\"Oberösterreich\",LOOKUP(B7,Dropdown_Bundesland!$F:$F,Dropdown_Bundesland!$J:$J),IF(Auswahl_Bundesland=\"Salzburg\",LOOKUP(B7,Dropdown_Bundesland!$F:$F,Dropdown_Bundesland!$K:$K),IF(AND(Auswahl_Bundesland=\"Steiermark\",Auswahl_Jahr>2012),LOOKUP(B7,Dropdown_Bundesland!$F:$F,Dropdown_Bundesland!$L:$L),IF(AND(Auswahl_Bundesland=\"Steiermark\",Auswahl_Jahr<2012),LOOKUP(B7,Dropdown_Bundesland!$F:$F,Dropdown_Bundesland!$P:$P),IF(AND(Auswahl_Bundesland=\"Steiermark\",Auswahl_Jahr=2012),LOOKUP(B7,Dropdown_Bundesland!$F:$F,Dropdown_Bundesland!$Q:$Q),IF(Auswahl_Bundesland=\"Tirol\",LOOKUP(B7,Dropdown_Bundesland!$F:$F,Dropdown_Bundesland!$M:$M),IF(Auswahl_Bundesland=\"Vorarlberg\",LOOKUP(B7,Dropdown_Bundesland!$F:$F,Dropdown_Bundesland!$N:$N),IF(Auswahl_Bundesland=\"Wien\",LOOKUP(B7,Dropdown_Bundesland!$F:$F,Dropdown_Bundesland!$O:$O),\"\"))))))))))))","v":"Oberwart"},1926,1998,2072,2131,2224,2296,2372,2611,2728,2901,3092,3211,3253,3283,3343,3368,3439,3560,3678,3772,3816,3845,3992,{"$f":"IF(ISERROR($A7),0,IF(INDEX(matrix_olap_bm,$A7,AA$1)=0,\".\",INDEX(matrix_olap_bm,$A7,AA$1)))","v":3994},3942]
[9,6,{"$f":"IF(Auswahl_Bundesland=\"Burgenland\",LOOKUP(B8,Dropdown_Bundesland!$F:$F,Dropdown_Bundesland!$G:$G),IF(Auswahl_Bundesland=\"Kärnten\",LOOKUP(B8,Dropdown_Bundesland!$F:$F,Dropdown_Bundesland!$H:$H),IF(AND(Auswahl_Bundesland=\"Niederösterreich\",Auswahl_Jahr>=2017),LOOKUP(B8,Dropdown_Bundesland!$F:$F,Dropdown_Bundesland!$R:$R),IF(AND(Auswahl_Bundesland=\"Niederösterreich\",Auswahl_Jahr<=2016),LOOKUP(B8,Dropdown_Bundesland!$F:$F,Dropdown_Bundesland!$I:$I),IF(Auswahl_Bundesland=\"Oberösterreich\",LOOKUP(B8,Dropdown_Bundesland!$F:$F,Dropdown_Bundesland!$J:$J),IF(Auswahl_Bundesland=\"Salzburg\",LOOKUP(B8,Dropdown_Bundesland!$F:$F,Dropdown_Bundesland!$K:$K),IF(AND(Auswahl_Bundesland=\"Steiermark\",Auswahl_Jahr>2012),LOOKUP(B8,Dropdown_Bundesland!$F:$F,Dropdown_Bundesland!$L:$L),IF(AND(Auswahl_Bundesland=\"Steiermark\",Auswahl_Jahr<2012),LOOKUP(B8,Dropdown_Bundesland!$F:$F,Dropdown_Bundesland!$P:$P),IF(AND(Auswahl_Bundesland=\"Steiermark\",Auswahl_Jahr=2012),LOOKUP(B8,Dropdown_Bundesland!$F:$F,Dropdown_Bundesland!$Q:$Q),IF(Auswahl_Bundesland=\"Tirol\",LOOKUP(B8,Dropdown_Bundesland!$F:$F,Dropdown_Bundesland!$M:$M),IF(Auswahl_Bundesland=\"Vorarlberg\",LOOKUP(B8,Dropdown_Bundesland!$F:$F,Dropdown_Bundesland!$N:$N),IF(Auswahl_Bundesland=\"Wien\",LOOKUP(B8,Dropdown_Bundesland!$F:$F,Dropdown_Bundesland!$O:$O),\"\"))))))))))))","v":"Güssing"},843,905,949,1025,1057,1097,1141,1223,1279,1371,1409,1512,1590,1708,1832,1883,1902,1917,1925,1890,1876,1816,1798,1777,1796]
{"$rows_left_out":62}
{"sheet":"olap_bm","index":5,"n_rows":401,"n_cols":31,"rows_kept":401,"cut":false,"hidden":true,"merged":[]}
[null,null,null,null,null,1,2,3,4,5,6,7,8,9,10,11,12,13,14,15,16,17,18,19,20,21,22,23,24,25,26]
["BLD_Bez","Zeilenindex","Bez_Nr","Land_Bez","Bez_Mgst","Bez_STAT",2001,2002,2003,2004,2005,2006,2007,2008,2009,2010,2011,2012,2013,2014,2015,2016,2017,2018,2019,2020,2021,2022,2023,2024,2025]
[{"$f":"C3&D3&F3","v":{"$error":"#N/A"}},3,"aktive","Burgenland","0 -im Bundesland gültig",{"$error":"#N/A"},0,2,6,90,13,16,34,43,38,38,43,35,39,44,14,22,51,49,50,43,42,50,54,56,56]
[{"$f":"C4&D4&F4","v":"aktiveBurgenlandEisenstadt-Umgebung"},4,"aktive","Burgenland","1 -Eisenstadt-Umgebung","Eisenstadt-Umgebung",2241,2344,2442,2589,2703,2745,2818,3116,3286,3521,3627,3677,3801,3870,4007,4054,4095,4181,4289,4311,4498,4506,4542,4618,4713]
["aktiveBurgenlandNeusiedl am See",5,"aktive","Burgenland","2 -Neusiedl am See","Neusiedl am See",1903,2013,2115,2203,2304,2330,2447,2632,2768,2976,3132,3373,3493,3638,3741,3968,4035,4210,4246,4332,4415,4593,4654,4685,4718]
["aktiveBurgenlandMattersburg",6,"aktive","Burgenland","3 -Mattersburg","Mattersburg",1386,1419,1459,1494,1579,1647,1702,1818,1919,2026,2025,2068,2116,2219,2250,2322,2352,2413,2435,2487,2554,2598,2600,2662,2751]
["aktiveBurgenlandOberpullendorf",7,"aktive","Burgenland","4 -Oberpullendorf","Oberpullendorf",1373,1340,1402,1470,1498,1574,1580,1735,1794,1894,2011,2061,2067,2182,2230,2317,2297,2355,2399,2486,2536,2626,2669,2692,2785]
["aktiveBurgenlandOberwart",8,"aktive","Burgenland","5 -Oberwart","Oberwart",1926,1998,2072,2131,2224,2296,2372,2611,2728,2901,3092,3211,3253,3283,3343,3368,3439,3560,3678,3772,3816,3845,3992,3994,3942]
{"$rows_left_out":394}
{"sheet":"Landkarte","index":6,"n_rows":12,"n_cols":5,"rows_kept":12,"cut":false,"hidden":true,"merged":[]}
[null,"Burgenland",1,{"$f":"Auswahl_Bundesland","v":"Burgenland"},{"$f":"IF(AND(Auswahl_Jahr<2012,Auswahl_Bundesland=\"Steiermark\"),10,IF(AND(Auswahl_Jahr=2012,Auswahl_Bundesland=\"Steiermark\"),11,IF(AND(Auswahl_Jahr>=2017,Auswahl_Bundesland=\"Niederösterreich\"),12,VLOOKUP(D1,B:C,2,FALSE))))","v":1}]
[null,"Kärnten",2]
[null,"Niederösterreich",3]
[null,"Oberösterreich",4]
[null,"Salzburg",5]
[null,"Steiermark",6]
[null,"Tirol",7]
[null,"Vorarlberg",8]
{"$rows_left_out":5}
{"sheet":"X_Y","index":7,"n_rows":123,"n_cols":3,"rows_kept":123,"cut":false,"hidden":true,"merged":[]}
["Bezirk","X","Y"]
["Eisenstadt-Umgebung",3.8,21500]
["Neusiedl am See",4.5,23000]
["Mattersburg",3.3,19300]
["Oberpullendorf",3.55,15000]
["Oberwart",3,10500]
["Güssing",3.1,5900]
["Jennersdorf",2.82,2500]
{"$rows_left_out":115}