{"text_format":"1","workbook":"xlsx","n_sheets":8,"sheets":["Dashboard","Dropdown_Jahr","Dropdown_Bundesland","olap_km_bld","olap_bm_auswahl","olap_bm","Landkarte","X_Y"],"not_rendered":{"charts":3,"images":15,"macros":1,"external_links":0,"defined_names":42,"comments":0,"pivot_tables":3},"unopened":[],"bounds":{"document_bytes":16777216,"sheet_cells":100000,"rows_first":2000,"rows_last":500,"rows_between":2000,"halvings":0,"cell_chars":16384,"cell_head_chars":4096},"cells_cut":0,"cells_raw":0,"read":"whole","date_system":"1900"}

{"sheet":"Dashboard","index":0,"n_rows":38,"n_cols":44,"rows_kept":38,"cut":false,"hidden":false,"merged":[[21,1,21,12],[25,0,26,0]]}
[]
[{"$f":"Auswahl_Bundesland & \":\"","v":"Burgenland:"},"KAMMERMITGLIEDER NACH BEZIRKEN",null,null,null,null,null,null,null,null,null,null,null,null,null,null,null,null,null,null,null,null,null,null,null,null,null,null,null,null,null,null,null,null,"bis 2016",null,null,"ab 2013",null,null,null,"bis 2011",2012,"ab 2017"]
["Ergebnisse der Mitgliederstatistik der Wirtschaftskammern Österreichs - Stand: 31.12.",null,null,null,null,null,{"$f":"Auswahl_Jahr","v":2025},null,null,null,null,null,null,null,1,"Beschriftung wegnehmen, da sonst du viele Zahlen",null,null,null,null,null,null,null,null,null,null,"Zeilenbeschriftungen",null,null,1,"Auswahl_Bundesland",null,{"$f":"COUNTA(AG5:AG28)","v":7},10,21,18,{"$f":"COUNTA(AK5:AK17)","v":6},{"$f":"COUNTA(AL5:AL28)","v":14},{"$f":"COUNTA(AM5:AM28)","v":9},4,23,{"$f":"COUNTA(AP5:AP26)","v":20},{"$f":"COUNTA(AQ5:AQ26)","v":17},{"$f":"COUNTA(AR5:AR27)","v":20}]
[null,null,null,null,null,null,null,null,null,null,null,null,null,null,2,"Bundesland einfärben, sonst geht es unter",null,null,null,null,null,null,null,null,null,null,"Burgenland",1,{"$f":"AA4","v":"Burgenland"},1,{"$f":"LOOKUP($AD$4,$AB$4:$AC$12)","v":"Burgenland"},null,"Burgenland","Kärnten","Niederösterreich","Oberösterreich","Salzburg","Steiermark","Tirol","Vorarlberg","Wien","Steiermark","Steiermark","Niederösterreich"]
[null,null,null,null,null,null,null,null,null,null,null,null,null,null,3,"Weniger in Kreisdiagramm",null,null,null,null,null,null,null,null,null,null,"Kärnten",2,"Kärnten",4,{"$f":"IF(AND($AD$5>AG3,Auswahl_Bundesland=\"Burgenland\"),AG5,IF(Auswahl_Bundesland=\"Burgenland\",LOOKUP($AD$5,$AF:$AF,$AG:$AG),IF(AND($AD$5>AH3,Auswahl_Bundesland=\"Kärnten\"),AH5,IF(Auswahl_Bundesland=\"Kärnten\",LOOKUP($AD$5,$AF:$AF,$AH:$AH),IF(AND($AD$5>AI3,Auswahl_Bundesland=\"Niederösterreich\",Auswahl_Jahr<=2016),AI5,IF(AND($AD$5>AR3,Auswahl_Bundesland=\"Niederösterreich\",Auswahl_Jahr>=2017),AR5,IF(AND($AD$5>AJ3,Auswahl_Bundesland=\"Oberösterreich\"),AJ5,IF(AND($AD$5>AK3,Auswahl_Bundesland=\"Salzburg\"),AK5,IF(AND($AD5>AL3,Auswahl_Bundesland=\"Steiermark\",Auswahl_Jahr>2012),AL5,IF(AND($AD$5>AP3,Auswahl_Bundesland=\"Steiermark\",Auswahl_Jahr<2012),AP5,IF(AND($AD$5>AQ3,Auswahl_Bundesland=\"Steiermark\",Auswahl_Jahr=2012),AQ5,IF(AND($AD$5>AM3,Auswahl_Bundesland=\"Tirol\"),AM5,IF(AND($AD$5>AN3,Auswahl_Bundesland=\"Vorarlberg\"),AN5,IF(AND($AD$5>AO3,Auswahl_Bundesland=\"Wien\"),AO5,IF(AND(Auswahl_Bundesland=\"Niederösterreich\",Auswahl_Jahr>=2017),LOOKUP($AD$5,$AF:$AF,$AR:$AR),IF(Auswahl_Bundesland=\"Oberösterreich\",LOOKUP($AD$5,$AF:$AF,$AJ:$AJ),IF(Auswahl_Bundesland=\"Salzburg\",LOOKUP($AD$5,$AF:$AF,$AK:$AK),IF(AND(Auswahl_Bundesland=\"Steiermark\",Auswahl_Jahr>2012),LOOKUP($AD$5,$AF:$AF,$AL:$AL),IF(AND(Auswahl_Bundesland=\"Steiermark\",Auswahl_Jahr<2012),LOOKUP($AD$5,$AF:$AF,$AP:$AP),IF(AND(Auswahl_Bundesland=\"Steiermark\",Auswahl_Jahr=2012),LOOKUP($AD$5,$AF:$AF,$AQ:$AQ),IF(Auswahl_Bundesland=\"Tirol\",LOOKUP($AD$5,$AF:$AF,$AM:$AM),IF(Auswahl_Bundesland=\"Vorarlberg\",LOOKUP($AD$5,$AF:$AF,$AN:$AN),IF(AND(Auswahl_Bundesland=\"Niederösterreich\",Auswahl_Jahr<=2016),LOOKUP($AD$5,$AF:$AF,$AI:$AI),IF(Auswahl_Bundesland=\"Wien\",LOOKUP($AD$5,$AF:$AF,$AO:$AO),\"\"))))))))))))))))))))))))","v":"Oberpullendorf"},1,"Eisenstadt-Umgebung","Feldkirchen","Amstetten","Linz","Salzburg","Graz","Innsbruck","Bludenz","Innere Stadt","Graz","Graz","Amstetten"]
[null,null,null,null,null,null,null,null,null,null,null,null,null,null,4,"Anteil des ausgewählten Bundeslandes anschreiben",null,null,null,null,null,null,null,null,null,null,"Niederösterreich",3,"Niederösterreich",null,null,2,"Neusiedl am See","Hermagor","Baden","Steyr","Hallein","Deutschlandsberg","Imst","Bregenz","Leopoldstadt","Deutschlandsberg","Deutschlandsberg","Baden"]
[null,null,null,null,null,null,null,null,null,null,null,null,null,null,5,"Veränderung für Murtal (neue Bezirke in der Steiermark) korrigieren",null,null,null,null,null,null,null,null,null,null,"Oberösterreich",4,"Oberösterreich",null,null,3,"Mattersburg","Klagenfurt-Land","Bruck an der Leitha","Wels","Salzburg-Umgebung","Graz-Umgebung","Innsbruck Land","Dornbirn","Landstraße","Graz-Umgebung","Graz-Umgebung","Bruck an der Leitha"]
[null,null,null,null,null,null,null,null,null,null,null,null,null,null,6,"Wenn sich Auswahl_Bundesland ändert immer ersten Bezirk auswählen --> nur mit Makro möglich",null,null,null,null,null,null,null,null,null,null,"Salzburg",5,"Salzburg",null,null,4,"Oberpullendorf","Klagenfurt am Wörthersee","Gänserndorf","Braunau am Inn","Sankt Johann im Pongau","Leibnitz","Kitzbühel","Feldkirch","Wieden","Leibnitz","Leibnitz","Gänserndorf"]
[{"$f":"Auswahl_Bundesland","v":"Burgenland"},null,null,null,null,null,null,null,null,null,null,null,null,null,7,"Wenn sich Auswahl_Jahr ändert, Auswahl_Bezirk belassen",null,null,null,null,null,null,null,null,null,null,"Steiermark",6,"Steiermark",null,null,5,"Oberwart","Sankt Veit an der Glan","Gmünd","Eferding","Tamsweg","Leoben","Kufstein",null,"Margareten","Leoben","Leoben","Gmünd"]
[{"$f":"Status","v":"Aktive"},null,null,null,null,null,null,null,null,null,null,null,null,null,null,null,null,null,null,null,null,null,null,null,null,null,"Tirol",7,"Tirol",null,null,6,"Güssing","Spittal an der Drau","Hollabrunn","Freistadt","Zell am See","Liezen","Landeck",null,"Mariahilf","Liezen","Liezen","Hollabrunn"]
["Kammermitglieder",null,null,null,null,null,null,null,null,null,null,null,null,null,null,null,null,null,null,null,null,null,null,null,null,null,"Vorarlberg",8,"Vorarlberg",null,null,7,"Jennersdorf","Villach-Land","Horn","Gmunden",null,"Murau","Lienz",null,"Neubau","Murau","Murau","Horn"]
[{"$f":"KM_Bundesland","v":21835},null,null,null,null,null,null,null,null,null,null,null,null,null,null,null,null,null,null,null,null,null,null,null,null,null,"Wien",9,"Wien",null,null,8,null,"Villach","Korneuburg","Grieskirchen",null,"Gröbming","Reutte",null,"Josefstadt","Gröbming","Gröbming","Korneuburg"]
["Veränderung zum Vj.",null,null,null,null,null,null,null,null,null,null,null,null,null,null,null,null,null,null,null,null,null,null,null,null,null,"Gesamtergebnis",null,null,null,null,9,null,"Völkermarkt","Krems-Land","Kirchdorf an der Krems",null,"Voitsberg","Schwaz",null,"Alsergrund","Voitsberg","Voitsberg","Krems-Land"]
[{"$f":"\"absolut: \" & Verae_absolut_bld","v":"absolut: 340"},null,null,null,null,null,null,null,null,null,null,null,null,null,null,null,null,null,null,null,null,null,null,null,null,null,null,null,null,null,null,10,null,"Wolfsberg","Lilienfeld","Linz-Land",null,"Weiz",null,null,"Favoriten","Weiz","Weiz","Lilienfeld"]
[{"$f":"\"in Prozent: \" & Verae_Proz_bld","v":"in Prozent: 1,6"},null,null,null,null,null,null,null,null,null,null,null,null,null,null,null,null,null,null,null,null,null,null,null,null,null,null,null,null,null,null,11,null,null,"Melk","Perg",null,"Murtal",null,null,"Simmering","Judenburg","Murtal","Melk"]
[null,null,null,null,null,null,null,null,null,null,null,null,null,null,null,null,null,null,null,null,null,null,null,null,null,null,null,null,null,null,null,12,null,null,"Mistelbach","Ried im Innkreis",null,"Bruck-Mürzzuschlag",null,null,"Meidling","Bruck an der Mur","Bruck an der Mur","Mistelbach"]
[null,null,null,null,null,null,null,null,null,null,null,null,null,null,null,null,null,null,null,null,null,null,null,null,null,null,null,null,null,null,null,13,null,null,"Mödling","Rohrbach",null,"Hartberg-Fürstenfeld",null,null,"Hietzing","Hartberg","Hartberg","Mödling"]
[null,null,null,null,null,null,null,null,null,null,null,null,null,null,null,null,null,null,null,null,null,null,null,null,null,null,null,null,null,null,null,14,null,null,"Neunkirchen","Schärding",null,"Südoststeiermark",null,null,"Penzing","Radkersburg","Radkersburg","Neunkirchen"]
[null,null,null,null,null,null,null,null,null,null,null,null,null,null,null,null,null,null,null,null,null,null,null,null,null,null,null,null,null,null,null,15,null,null,"Sankt Pölten-Land","Steyr-Land",null,null,null,null,"Rudolfsheim-Fünfhaus","Mürzzuschlag","Mürzzuschlag","Sankt Pölten-Land"]
[null,null,null,null,null,null,null,null,null,null,null,null,null,null,null,null,null,null,null,null,null,null,null,null,null,null,null,null,null,null,null,16,null,null,"Scheibbs","Urfahr-Umgebung",null,null,null,null,"Ottakring","Fürstenfeld","Fürstenfeld","Scheibbs"]
[null,null,null,null,null,null,null,null,null,null,null,null,null,null,null,null,null,null,null,null,null,null,null,null,null,null,null,null,null,null,null,17,null,null,"Tulln","Vöcklabruck",null,null,null,null,"Hernals","Feldbach","Feldbach","Tulln"]
[null,{"$f":"Kartentitel","v":"Aktive Kammermitglieder nach Bezirken in Burgenland 2025"},null,null,null,null,null,null,null,null,null,null,null,null,null,null,null,null,null,null,null,null,null,null,null,null,null,null,null,null,null,18,null,null,"Waidhofen an der Thaya","Wels-Land",null,null,null,null,"Währing","Knittelfeld",null,"Waidhofen an der Thaya"]
[null,null,null,null,null,null,null,null,null,null,null,null,null,null,null,null,null,null,null,null,null,null,null,null,null,null,null,null,null,null,null,19,null,null,"Wiener Neustadt-Land",null,null,null,null,null,"Döbling","Bad Aussee",null,"Wiener Neustadt-Land"]
[null,null,null,null,null,null,null,null,null,null,null,null,null,null,null,null,null,null,null,null,null,null,null,null,null,null,null,null,null,null,null,20,null,null,"Wien-Umgebung",null,null,null,null,null,"Brigittenau","Mariazell",null,"Zwettl"]
[null,null,null,null,null,null,null,null,null,null,null,null,null,null,null,null,null,null,null,null,null,null,null,null,null,null,null,null,null,null,null,21,null,null,"Zwettl",null,null,null,null,null,"Floridsdorf"]
[{"$f":"Auswahl_Bezirk","v":"Oberpullendorf"},null,null,null,null,null,null,null,null,null,null,null,null,null,null,null,null,null,null,null,null,null,null,null,null,null,null,null,null,null,null,22,null,null,null,null,null,null,null,null,"Donaustadt"]
[null,null,null,null,null,null,null,null,null,null,null,null,null,null,null,null,null,null,null,null,null,null,null,null,null,null,null,null,null,null,null,23,null,null,null,null,null,null,null,null,"Liesing"]
[{"$f":"Status","v":"Aktive"}]
["Bezirksmitglieder"]
[{"$f":"KM_Bezirk","v":2785}]
["Veränderung zum Vj."]
[{"$f":"\"absolut: \" & Verae_absolut_bezirk","v":"absolut: 93"}]
[{"$f":"\"in Prozent: \" & Verae_Proz_bezirk","v":"in Prozent: 3,5"}]
["Anteil des Bezirks"]
["am Bundesland"]
[{"$f":"\"in Prozent: \" & Anteil_bez","v":"in Prozent: 12,5"}]
[]
["Die Summe der Bezirksmitgliedschaften kann durch das Auftreten von Mehrfachmitgliedschaften (Mitgliedschaften in mehreren Bezirken) von der Summe der (Landes-)Kammermitgliedschaften abweichen."]

{"sheet":"Dropdown_Jahr","index":1,"n_rows":33,"n_cols":3,"rows_kept":33,"cut":false,"hidden":true,"merged":[]}
[]
[]
["Zeilenbeschriftungen",null,"Auswahl"]
["Jahresstatistik 2001",{"$f":"IF(LEFT(A4,5)=\"Jahre\",RIGHT(A4,4),\"\")","v":"2001"},2025]
["Jahresstatistik 2002",{"$f":"IF(LEFT(A5,5)=\"Jahre\",RIGHT(A5,4),\"\")","v":"2002"}]
["Jahresstatistik 2003","2003"]
["Jahresstatistik 2004","2004"]
["Jahresstatistik 2005","2005"]
["Jahresstatistik 2006","2006"]
["Jahresstatistik 2007","2007"]
["Jahresstatistik 2008","2008"]
["Jahresstatistik 2009","2009"]
["Jahresstatistik 2010","2010"]
["Jahresstatistik 2011","2011"]
["Jahresstatistik 2012","2012"]
["Jahresstatistik 2013","2013"]
["Jahresstatistik 2014","2014"]
["Jahresstatistik 2015","2015"]
["Jahresstatistik 2016",{"$f":"IF(LEFT(A19,5)=\"Jahre\",RIGHT(A19,4),\"\")","v":"2016"}]
["Jahresstatistik 2017","2017"]
["Jahresstatistik 2018",{"$f":"IF(LEFT(A21,5)=\"Jahre\",RIGHT(A21,4),\"\")","v":"2018"}]
["Jahresstatistik 2019","2019"]
["Jahresstatistik 2020","2020"]
["Jahresstatistik 2021","2021"]
["Jahresstatistik 2022","2022"]
["Jahresstatistik 2023","2023"]
["Jahresstatistik 2024","2024"]
["Jahresstatistik 2025","2025"]
[null,""]
[null,""]
[null,""]
[null,""]
[null,""]

{"sheet":"Dropdown_Bundesland","index":2,"n_rows":27,"n_cols":18,"rows_kept":27,"cut":false,"hidden":true,"merged":[]}
[]
[null,null,null,null,null,null,null,null,"bis 2016",null,null,"ab 2013",null,null,null,"bis 2011",2012,"ab 2017"]
["Zeilenbeschriftungen",null,null,2,"Auswahl_Bundesland",null,{"$f":"COUNTA(G5:G28)","v":7},10,21,18,{"$f":"COUNTA(K5:K17)","v":6},{"$f":"COUNTA(L5:L28)","v":14},{"$f":"COUNTA(M5:M28)","v":9},4,23,{"$f":"COUNTA(P5:P26)","v":20},{"$f":"COUNTA(Q5:Q26)","v":17},{"$f":"COUNTA(R5:R27)","v":20}]
["Burgenland",1,{"$f":"A4","v":"Burgenland"},{"$f":"Dashboard!AD4","v":1},{"$f":"Dashboard!AE4","v":"Burgenland"},null,"Burgenland","Kärnten","Niederösterreich","Oberösterreich","Salzburg","Steiermark","Tirol","Vorarlberg","Wien","Steiermark","Steiermark","Niederösterreich"]
["Kärnten",2,"Kärnten",{"$f":"Dashboard!AD5","v":4},{"$f":"Dashboard!AE5","v":"Oberpullendorf"},1,"Eisenstadt-Umgebung","Feldkirchen","Amstetten","Linz","Salzburg","Graz","Innsbruck","Bludenz","Innere Stadt","Graz","Graz","Amstetten"]
["Niederösterreich",3,"Niederösterreich",null,null,2,"Neusiedl am See","Hermagor","Baden","Steyr","Hallein","Deutschlandsberg","Imst","Bregenz","Leopoldstadt","Deutschlandsberg","Deutschlandsberg","Baden"]
["Oberösterreich",4,"Oberösterreich",null,null,3,"Mattersburg","Klagenfurt-Land","Bruck an der Leitha","Wels","Salzburg-Umgebung","Graz-Umgebung","Innsbruck Land","Dornbirn","Landstraße","Graz-Umgebung","Graz-Umgebung","Bruck an der Leitha"]
["Salzburg",5,"Salzburg",null,null,4,"Oberpullendorf","Klagenfurt am Wörthersee","Gänserndorf","Braunau am Inn","Sankt Johann im Pongau","Leibnitz","Kitzbühel","Feldkirch","Wieden","Leibnitz","Leibnitz","Gänserndorf"]
["Steiermark",6,"Steiermark",null,null,5,"Oberwart","Sankt Veit an der Glan","Gmünd","Eferding","Tamsweg","Leoben","Kufstein",null,"Margareten","Leoben","Leoben","Gmünd"]
["Tirol",7,"Tirol",null,null,6,"Güssing","Spittal an der Drau","Hollabrunn","Freistadt","Zell am See","Liezen","Landeck",null,"Mariahilf","Liezen","Liezen","Hollabrunn"]
["Vorarlberg",8,"Vorarlberg",null,null,7,"Jennersdorf","Villach-Land","Horn","Gmunden",null,"Murau","Lienz",null,"Neubau","Murau","Murau","Horn"]
["Wien",9,"Wien",null,null,8,null,"Villach","Korneuburg","Grieskirchen",null,"Gröbming","Reutte",null,"Josefstadt","Gröbming","Gröbming","Korneuburg"]
["Gesamtergebnis",null,null,null,null,9,null,"Völkermarkt","Krems-Land","Kirchdorf an der Krems",null,"Voitsberg","Schwaz",null,"Alsergrund","Voitsberg","Voitsberg","Krems-Land"]
[null,null,null,null,null,10,null,"Wolfsberg","Lilienfeld","Linz-Land",null,"Weiz",null,null,"Favoriten","Weiz","Weiz","Lilienfeld"]
[null,null,null,null,null,11,null,null,"Melk","Perg",null,"Murtal",null,null,"Simmering","Judenburg","Murtal","Melk"]
[null,null,null,null,null,12,null,null,"Mistelbach","Ried im Innkreis",null,"Bruck-Mürzzuschlag",null,null,"Meidling","Bruck an der Mur","Bruck an der Mur","Mistelbach"]
[null,null,null,null,null,13,null,null,"Mödling","Rohrbach",null,"Hartberg-Fürstenfeld",null,null,"Hietzing","Hartberg","Hartberg","Mödling"]
[null,null,null,null,null,14,null,null,"Neunkirchen","Schärding",null,"Südoststeiermark",null,null,"Penzing","Radkersburg","Radkersburg","Neunkirchen"]
[null,null,null,null,null,15,null,null,"Sankt Pölten-Land","Steyr-Land",null,null,null,null,"Rudolfsheim-Fünfhaus","Mürzzuschlag","Mürzzuschlag","Sankt Pölten-Land"]
[null,null,null,null,null,16,null,null,"Scheibbs","Urfahr-Umgebung",null,null,null,null,"Ottakring","Fürstenfeld","Fürstenfeld","Scheibbs"]
[null,null,null,null,null,17,null,null,"Tulln","Vöcklabruck",null,null,null,null,"Hernals","Feldbach","Feldbach","Tulln"]
[null,null,null,null,null,18,null,null,"Waidhofen an der Thaya","Wels-Land",null,null,null,null,"Währing","Knittelfeld",null,"Waidhofen an der Thaya"]
[null,null,null,null,null,19,null,null,"Wiener Neustadt-Land",null,null,null,null,null,"Döbling","Bad Aussee",null,"Wiener Neustadt-Land"]
[null,null,null,null,null,20,null,null,"Wien-Umgebung",null,null,null,null,null,"Brigittenau","Mariazell",null,"Zwettl"]
[null,null,null,null,null,21,null,null,"Zwettl",null,null,null,null,null,"Floridsdorf"]
[null,null,null,null,null,22,null,null,null,null,null,null,null,null,"Donaustadt"]
[null,null,null,null,null,23,null,null,null,null,null,null,null,null,"Liesing"]

{"sheet":"olap_km_bld","index":3,"n_rows":91,"n_cols":43,"rows_kept":91,"cut":false,"hidden":true,"merged":[]}
["Status","Aktiv",1,{"$f":"IF($C$1=1,\"Aktive\",IF($C$1=2,\"Ruhende\",\"Gesamte\"))","v":"Aktive"}]
["Aktiv",2001,2002,2003,2004,2005,2006,2007,2008,2009,2010,2011,2012,2013,2014,2015,2016,2017,2018,2019,2020,2021,2022,2023,2024,2025,{"$error":"#VALUE!"},{"$error":"#VALUE!"},{"$error":"#VALUE!"},{"$error":"#VALUE!"},{"$error":"#VALUE!"},{"$error":"#VALUE!"},{"$error":"#VALUE!"},{"$error":"#VALUE!"},{"$error":"#VALUE!"},{"$error":"#VALUE!"},{"$error":"#VALUE!"},{"$error":"#VALUE!"},{"$error":"#VALUE!"},{"$error":"#VALUE!"},{"$error":"#VALUE!"},{"$error":"#VALUE!"},{"$error":"#VALUE!"}]
["Anzahl Mitglieder","Spaltenbeschriftungen"]
["Zeilenbeschriftungen","Jahresstatistik 2001","Jahresstatistik 2002","Jahresstatistik 2003","Jahresstatistik 2004","Jahresstatistik 2005","Jahresstatistik 2006","Jahresstatistik 2007","Jahresstatistik 2008","Jahresstatistik 2009","Jahresstatistik 2010","Jahresstatistik 2011","Jahresstatistik 2012","Jahresstatistik 2013","Jahresstatistik 2014","Jahresstatistik 2015","Jahresstatistik 2016","Jahresstatistik 2017","Jahresstatistik 2018","Jahresstatistik 2019","Jahresstatistik 2020","Jahresstatistik 2021","Jahresstatistik 2022","Jahresstatistik 2023","Jahresstatistik 2024","Jahresstatistik 2025"]
["Burgenland",9761,10119,10579,11063,11540,11883,12296,13409,14068,15011,15666,16264,16711,17321,17908,18532,18870,19393,19790,20090,20546,20962,21240,21495,21835]
["Kärnten",21147,21678,22305,22809,23487,24199,24889,25591,26217,26639,27425,28325,29561,30916,31565,32559,33112,33964,34446,35292,36330,36751,37491,38265,39384]
["Niederösterreich",54428,56325,58737,61350,63672,65815,68136,73473,76649,80423,83404,86657,90021,93258,96650,99737,102299,103892,105885,107881,111367,112937,114598,116166,118550]
["Oberösterreich",46551,48140,49935,51712,53412,54900,56150,60717,63015,65024,66607,68099,70357,72613,74718,76572,78447,79638,80796,82966,85634,87042,87878,88944,91092]
["Salzburg",25168,25669,26458,27115,27632,28148,28884,29854,30510,31344,32137,32825,33553,34457,35242,36014,36437,37221,37902,38392,39792,40351,40982,41632,42261]
["Steiermark",41803,43501,45163,46679,48479,49787,51177,53659,55390,57517,59174,60998,63491,65989,68143,70333,72684,74654,76404,78681,81497,82829,84031,85466,86559]
["Tirol",29881,30835,31830,32863,33482,34065,35135,36186,36999,37916,38741,39609,40673,41545,42593,43776,44785,45521,46521,47516,49429,50562,51435,52161,53184]
["Vorarlberg",15108,15414,15666,16136,16238,16390,16564,17555,18004,18539,19142,19591,20087,20706,21212,21540,21879,22334,22772,23235,24040,24471,24952,25121,25706]
["Wien",67453,69092,71420,76279,79914,82661,85238,89225,92732,96011,97181,99281,101733,102533,104454,107082,108964,111334,113120,114870,118359,120158,121841,124389,127255]
["Gesamtergebnis",311300,320773,332093,346006,357856,367848,378469,399669,413584,428424,439477,451649,466187,479338,492485,506145,517477,527951,537636,548923,566994,576063,584448,593639,605826]
[]
["Status","Ruhend"]
["Ruhend",2001,2002,2003,2004,2005,2006,2007,2008,2009,2010,2011,2012,2013,2014,2015,2016,2017,2018,2019,2020,2021,2022,2023,2024,2025,{"$error":"#VALUE!"},{"$error":"#VALUE!"},{"$error":"#VALUE!"},{"$error":"#VALUE!"},{"$error":"#VALUE!"},{"$error":"#VALUE!"},{"$error":"#VALUE!"},{"$error":"#VALUE!"},{"$error":"#VALUE!"},{"$error":"#VALUE!"},{"$error":"#VALUE!"},{"$error":"#VALUE!"},{"$error":"#VALUE!"},{"$error":"#VALUE!"},{"$error":"#VALUE!"},{"$error":"#VALUE!"},{"$error":"#VALUE!"}]
["Anzahl Mitglieder","Spaltenbeschriftungen"]
["Zeilenbeschriftungen","Jahresstatistik 2001","Jahresstatistik 2002","Jahresstatistik 2003","Jahresstatistik 2004","Jahresstatistik 2005","Jahresstatistik 2006","Jahresstatistik 2007","Jahresstatistik 2008","Jahresstatistik 2009","Jahresstatistik 2010","Jahresstatistik 2011","Jahresstatistik 2012","Jahresstatistik 2013","Jahresstatistik 2014","Jahresstatistik 2015","Jahresstatistik 2016","Jahresstatistik 2017","Jahresstatistik 2018","Jahresstatistik 2019","Jahresstatistik 2020","Jahresstatistik 2021","Jahresstatistik 2022","Jahresstatistik 2023","Jahresstatistik 2024","Jahresstatistik 2025"]
["Burgenland",2088,2185,2312,2433,2525,2595,2630,3223,3670,4170,4686,5178,5605,6039,6506,6608,6504,6431,6048,6350,5835,5691,5219,5237,5249]
["Kärnten",5318,5474,5786,5764,5667,5499,5466,5582,5795,6106,6245,6713,7117,7436,7721,7804,8149,7679,7548,7689,7226,7075,6969,7081,7194]
["Niederösterreich",18362,19124,19985,20497,20922,21242,21343,21993,22977,24004,25103,26298,27065,28067,29031,29193,29850,29589,29472,31025,30760,29206,27093,26747,26461]
["Oberösterreich",12846,13377,13736,13892,13933,13726,13944,14276,14848,15217,15526,16107,16639,16960,17390,17752,17957,17939,18090,18878,18880,18234,17568,17487,17478]
["Salzburg",7454,7826,7938,7834,7965,7924,7758,7774,7879,7919,8125,8145,8340,8478,8559,8385,8336,8229,8042,8455,7896,7728,7550,7466,7487]
["Steiermark",10415,11108,11583,11943,12090,11964,11997,12284,12616,13068,13539,14233,15010,15518,15908,16101,16606,16518,16476,17380,16854,16220,15730,15965,15981]
["Tirol",7367,7509,7734,7615,7608,7628,7548,7665,7870,7891,7944,8120,8381,8393,8370,8529,8526,8194,8095,8108,7814,7456,7446,7529,7506]
["Vorarlberg",3846,3959,4088,4147,4155,3962,3876,3888,3952,3891,3883,3947,4011,3964,4047,3963,4077,3994,4028,4116,3976,3894,3814,3895,3862]
["Wien",21940,22535,23086,23482,23807,24299,24774,25246,25671,26446,26895,27513,27995,28519,29186,29203,28870,28457,28099,29075,27808,27104,25903,25855,25831]
["Gesamtergebnis",89636,93097,96248,97607,98672,98839,99336,101931,105278,108712,111946,116254,120163,123374,126718,127538,128875,127030,125898,131076,127049,122608,117292,117262,117049]
[]
["Status","Insgesamt"]
["Insgesamt",2001,2002,2003,2004,2005,2006,2007,2008,2009,2010,2011,2012,2013,2014,2015,2016,2017,2018,2019,2020,2021,2022,2023,2024,2025,{"$error":"#VALUE!"},{"$error":"#VALUE!"},{"$error":"#VALUE!"},{"$error":"#VALUE!"},{"$error":"#VALUE!"},{"$error":"#VALUE!"},{"$error":"#VALUE!"},{"$error":"#VALUE!"},{"$error":"#VALUE!"},{"$error":"#VALUE!"},{"$error":"#VALUE!"},{"$error":"#VALUE!"},{"$error":"#VALUE!"},{"$error":"#VALUE!"},{"$error":"#VALUE!"},{"$error":"#VALUE!"},{"$error":"#VALUE!"}]
["Anzahl Mitglieder","Spaltenbeschriftungen"]
["Zeilenbeschriftungen","Jahresstatistik 2001","Jahresstatistik 2002","Jahresstatistik 2003","Jahresstatistik 2004","Jahresstatistik 2005","Jahresstatistik 2006","Jahresstatistik 2007","Jahresstatistik 2008","Jahresstatistik 2009","Jahresstatistik 2010","Jahresstatistik 2011","Jahresstatistik 2012","Jahresstatistik 2013","Jahresstatistik 2014","Jahresstatistik 2015","Jahresstatistik 2016","Jahresstatistik 2017","Jahresstatistik 2018","Jahresstatistik 2019","Jahresstatistik 2020","Jahresstatistik 2021","Jahresstatistik 2022","Jahresstatistik 2023","Jahresstatistik 2024","Jahresstatistik 2025"]
["Burgenland",11849,12304,12891,13496,14065,14478,14926,16632,17738,19181,20352,21442,22316,23360,24414,25140,25374,25824,25838,26440,26381,26653,26459,26732,27084]
["Kärnten",26465,27152,28091,28573,29154,29698,30355,31173,32012,32745,33670,35038,36678,38352,39286,40363,41261,41643,41994,42981,43556,43826,44460,45346,46578]
["Niederösterreich",72790,75449,78722,81847,84594,87057,89479,95466,99626,104427,108507,112955,117086,121325,125681,128930,132149,133481,135357,138906,142127,142143,141691,142913,145011]
["Oberösterreich",59397,61517,63671,65604,67345,68626,70094,74993,77863,80241,82133,84206,86996,89573,92108,94324,96404,97577,98886,101844,104514,105276,105446,106431,108570]
["Salzburg",32622,33495,34396,34949,35597,36072,36642,37628,38389,39263,40262,40970,41893,42935,43801,44399,44773,45450,45944,46847,47688,48079,48532,49098,49748]
["Steiermark",52218,54609,56746,58622,60569,61751,63174,65943,68006,70585,72713,75231,78501,81507,84051,86434,89290,91172,92880,96061,98351,99049,99761,101431,102540]
["Tirol",37248,38344,39564,40478,41090,41693,42683,43851,44869,45807,46685,47729,49054,49938,50963,52305,53311,53715,54616,55624,57243,58018,58881,59690,60690]
["Vorarlberg",18954,19373,19754,20283,20393,20352,20440,21443,21956,22430,23025,23538,24098,24670,25259,25503,25956,26328,26800,27351,28016,28365,28766,29016,29568]
["Wien",89393,91627,94506,99761,103721,106960,110012,114471,118403,122457,124076,126794,129728,131052,133640,136285,137834,139791,141219,143945,146167,147262,147744,150244,153086]
["Gesamtergebnis",400936,413870,428341,443613,456528,466687,477805,501600,518862,537136,551423,567903,586350,602712,619203,633683,646352,654981,663534,679999,694043,698671,701740,710901,722875]
[]
[]
[{"$f":"Status","v":"Aktive"},{"$f":"IF(Status=\"Aktive\",B2,IF(Status=\"Ruhende\",B17,B32))","v":2001},2002,2003,2004,2005,2006,2007,2008,2009,2010,2011,2012,2013,2014,2015,{"$f":"IF(Status=\"Aktive\",Q2,IF(Status=\"Ruhende\",Q17,Q32))","v":2016},2017,{"$f":"IF(Status=\"Aktive\",S2,IF(Status=\"Ruhende\",S17,S32))","v":2018},2019,{"$f":"IF(Status=\"Aktive\",U2,IF(Status=\"Ruhende\",U17,U32))","v":2020},2021,2022,{"$f":"IF(Status=\"Aktive\",X2,IF(Status=\"Ruhende\",X17,X32))","v":2023},2024,{"$f":"IF(Status=\"Aktive\",Z2,IF(Status=\"Ruhende\",Z17,Z32))","v":2025}]
[{"$f":"IF(Status=\"Aktive\",A3,IF(Status=\"Ruhende\",A18,A33))","v":"Anzahl Mitglieder"}]
["Zeilenbeschriftungen",{"$f":"IF(Status=\"Aktive\",B4,IF(Status=\"Ruhende\",B19,B34))","v":"Jahresstatistik 2001"},"Jahresstatistik 2002","Jahresstatistik 2003","Jahresstatistik 2004","Jahresstatistik 2005","Jahresstatistik 2006","Jahresstatistik 2007","Jahresstatistik 2008","Jahresstatistik 2009","Jahresstatistik 2010","Jahresstatistik 2011","Jahresstatistik 2012","Jahresstatistik 2013","Jahresstatistik 2014","Jahresstatistik 2015",{"$f":"IF(Status=\"Aktive\",Q4,IF(Status=\"Ruhende\",Q19,Q34))","v":"Jahresstatistik 2016"},"Jahresstatistik 2017",{"$f":"IF(Status=\"Aktive\",S4,IF(Status=\"Ruhende\",S19,S34))","v":"Jahresstatistik 2018"},"Jahresstatistik 2019",{"$f":"IF(Status=\"Aktive\",U4,IF(Status=\"Ruhende\",U19,U34))","v":"Jahresstatistik 2020"},"Jahresstatistik 2021",{"$f":"IF(Status=\"Aktive\",W4,IF(Status=\"Ruhende\",W19,W34))","v":"Jahresstatistik 2022"},"Jahresstatistik 2023",{"$f":"IF(Status=\"Aktive\",Y4,IF(Status=\"Ruhende\",Y19,Y34))","v":"Jahresstatistik 2024"},"Jahresstatistik 2025"]
["Burgenland",{"$f":"IF(Status=\"Aktive\",B5,IF(Status=\"Ruhende\",B20,B35))","v":9761},10119,10579,11063,11540,11883,12296,13409,14068,15011,15666,16264,16711,17321,17908,{"$f":"IF(Status=\"Aktive\",Q5,IF(Status=\"Ruhende\",Q20,Q35))","v":18532},18870,{"$f":"IF(Status=\"Aktive\",S5,IF(Status=\"Ruhende\",S20,S35))","v":19393},19790,{"$f":"IF(Status=\"Aktive\",U5,IF(Status=\"Ruhende\",U20,U35))","v":20090},20546,{"$f":"IF(Status=\"Aktive\",W5,IF(Status=\"Ruhende\",W20,W35))","v":20962},21240,{"$f":"IF(Status=\"Aktive\",Y5,IF(Status=\"Ruhende\",Y20,Y35))","v":21495},21835]
["Kärnten",{"$f":"IF(Status=\"Aktive\",B6,IF(Status=\"Ruhende\",B21,B36))","v":21147},21678,22305,22809,23487,24199,24889,25591,26217,26639,27425,28325,29561,30916,31565,{"$f":"IF(Status=\"Aktive\",Q6,IF(Status=\"Ruhende\",Q21,Q36))","v":32559},33112,{"$f":"IF(Status=\"Aktive\",S6,IF(Status=\"Ruhende\",S21,S36))","v":33964},34446,{"$f":"IF(Status=\"Aktive\",U6,IF(Status=\"Ruhende\",U21,U36))","v":35292},36330,{"$f":"IF(Status=\"Aktive\",W6,IF(Status=\"Ruhende\",W21,W36))","v":36751},37491,{"$f":"IF(Status=\"Aktive\",Y6,IF(Status=\"Ruhende\",Y21,Y36))","v":38265},39384]
["Niederösterreich",{"$f":"IF(Status=\"Aktive\",B7,IF(Status=\"Ruhende\",B22,B37))","v":54428},56325,58737,61350,63672,65815,68136,73473,76649,80423,83404,86657,90021,93258,96650,{"$f":"IF(Status=\"Aktive\",Q7,IF(Status=\"Ruhende\",Q22,Q37))","v":99737},102299,{"$f":"IF(Status=\"Aktive\",S7,IF(Status=\"Ruhende\",S22,S37))","v":103892},105885,{"$f":"IF(Status=\"Aktive\",U7,IF(Status=\"Ruhende\",U22,U37))","v":107881},111367,{"$f":"IF(Status=\"Aktive\",W7,IF(Status=\"Ruhende\",W22,W37))","v":112937},114598,{"$f":"IF(Status=\"Aktive\",Y7,IF(Status=\"Ruhende\",Y22,Y37))","v":116166},118550]
["Oberösterreich",{"$f":"IF(Status=\"Aktive\",B8,IF(Status=\"Ruhende\",B23,B38))","v":46551},48140,49935,51712,53412,54900,56150,60717,63015,65024,66607,68099,70357,72613,74718,{"$f":"IF(Status=\"Aktive\",Q8,IF(Status=\"Ruhende\",Q23,Q38))","v":76572},78447,{"$f":"IF(Status=\"Aktive\",S8,IF(Status=\"Ruhende\",S23,S38))","v":79638},80796,{"$f":"IF(Status=\"Aktive\",U8,IF(Status=\"Ruhende\",U23,U38))","v":82966},85634,{"$f":"IF(Status=\"Aktive\",W8,IF(Status=\"Ruhende\",W23,W38))","v":87042},87878,{"$f":"IF(Status=\"Aktive\",Y8,IF(Status=\"Ruhende\",Y23,Y38))","v":88944},91092]
["Salzburg",{"$f":"IF(Status=\"Aktive\",B9,IF(Status=\"Ruhende\",B24,B39))","v":25168},25669,26458,27115,27632,28148,28884,29854,30510,31344,32137,32825,33553,34457,35242,{"$f":"IF(Status=\"Aktive\",Q9,IF(Status=\"Ruhende\",Q24,Q39))","v":36014},36437,{"$f":"IF(Status=\"Aktive\",S9,IF(Status=\"Ruhende\",S24,S39))","v":37221},37902,{"$f":"IF(Status=\"Aktive\",U9,IF(Status=\"Ruhende\",U24,U39))","v":38392},39792,{"$f":"IF(Status=\"Aktive\",W9,IF(Status=\"Ruhende\",W24,W39))","v":40351},40982,{"$f":"IF(Status=\"Aktive\",Y9,IF(Status=\"Ruhende\",Y24,Y39))","v":41632},42261]
["Steiermark",{"$f":"IF(Status=\"Aktive\",B10,IF(Status=\"Ruhende\",B25,B40))","v":41803},43501,45163,46679,48479,49787,51177,53659,55390,57517,59174,60998,63491,65989,68143,{"$f":"IF(Status=\"Aktive\",Q10,IF(Status=\"Ruhende\",Q25,Q40))","v":70333},72684,{"$f":"IF(Status=\"Aktive\",S10,IF(Status=\"Ruhende\",S25,S40))","v":74654},76404,{"$f":"IF(Status=\"Aktive\",U10,IF(Status=\"Ruhende\",U25,U40))","v":78681},81497,{"$f":"IF(Status=\"Aktive\",W10,IF(Status=\"Ruhende\",W25,W40))","v":82829},84031,{"$f":"IF(Status=\"Aktive\",Y10,IF(Status=\"Ruhende\",Y25,Y40))","v":85466},86559]
["Tirol",{"$f":"IF(Status=\"Aktive\",B11,IF(Status=\"Ruhende\",B26,B41))","v":29881},30835,31830,32863,33482,34065,35135,36186,36999,37916,38741,39609,40673,41545,42593,{"$f":"IF(Status=\"Aktive\",Q11,IF(Status=\"Ruhende\",Q26,Q41))","v":43776},44785,{"$f":"IF(Status=\"Aktive\",S11,IF(Status=\"Ruhende\",S26,S41))","v":45521},46521,{"$f":"IF(Status=\"Aktive\",U11,IF(Status=\"Ruhende\",U26,U41))","v":47516},49429,{"$f":"IF(Status=\"Aktive\",W11,IF(Status=\"Ruhende\",W26,W41))","v":50562},51435,{"$f":"IF(Status=\"Aktive\",Y11,IF(Status=\"Ruhende\",Y26,Y41))","v":52161},53184]
["Vorarlberg",{"$f":"IF(Status=\"Aktive\",B12,IF(Status=\"Ruhende\",B27,B42))","v":15108},15414,15666,16136,16238,16390,16564,17555,18004,18539,19142,19591,20087,20706,21212,{"$f":"IF(Status=\"Aktive\",Q12,IF(Status=\"Ruhende\",Q27,Q42))","v":21540},21879,{"$f":"IF(Status=\"Aktive\",S12,IF(Status=\"Ruhende\",S27,S42))","v":22334},22772,{"$f":"IF(Status=\"Aktive\",U12,IF(Status=\"Ruhende\",U27,U42))","v":23235},24040,{"$f":"IF(Status=\"Aktive\",W12,IF(Status=\"Ruhende\",W27,W42))","v":24471},24952,{"$f":"IF(Status=\"Aktive\",Y12,IF(Status=\"Ruhende\",Y27,Y42))","v":25121},25706]
["Wien",{"$f":"IF(Status=\"Aktive\",B13,IF(Status=\"Ruhende\",B28,B43))","v":67453},69092,71420,76279,79914,82661,85238,89225,92732,96011,97181,99281,101733,102533,104454,{"$f":"IF(Status=\"Aktive\",Q13,IF(Status=\"Ruhende\",Q28,Q43))","v":107082},108964,{"$f":"IF(Status=\"Aktive\",S13,IF(Status=\"Ruhende\",S28,S43))","v":111334},113120,{"$f":"IF(Status=\"Aktive\",U13,IF(Status=\"Ruhende\",U28,U43))","v":114870},118359,{"$f":"IF(Status=\"Aktive\",W13,IF(Status=\"Ruhende\",W28,W43))","v":120158},121841,{"$f":"IF(Status=\"Aktive\",Y13,IF(Status=\"Ruhende\",Y28,Y43))","v":124389},127255]
["Gesamtergebnis",{"$f":"IF(Status=\"Aktive\",B14,IF(Status=\"Ruhende\",B29,B44))","v":311300},320773,332093,346006,357856,367848,378469,399669,413584,428424,439477,451649,466187,479338,492485,{"$f":"IF(Status=\"Aktive\",Q14,IF(Status=\"Ruhende\",Q29,Q44))","v":506145},517477,{"$f":"IF(Status=\"Aktive\",S14,IF(Status=\"Ruhende\",S29,S44))","v":527951},537636,{"$f":"IF(Status=\"Aktive\",U14,IF(Status=\"Ruhende\",U29,U44))","v":548923},566994,{"$f":"IF(Status=\"Aktive\",W14,IF(Status=\"Ruhende\",W29,W44))","v":576063},584448,{"$f":"IF(Status=\"Aktive\",Y14,IF(Status=\"Ruhende\",Y29,Y44))","v":593639},605826]
[]
[]
[null,{"$f":"Auswahl_Jahr","v":2025},{"$f":"Auswahl_Jahr-1","v":2024},"Anteil","Veraend_abs","Veraend_Proz","X","Y",null,null,{"$f":"\"Verae_absolut_\"&Auswahl_Bundesland","v":"Verae_absolut_Burgenland"},{"$f":"\"Verae_Proz_\"&Auswahl_Bundesland","v":"Verae_Proz_Burgenland"},null,"Max_Veraend_abs","Max_Veraend_Proz"]
["Burgenland",{"$f":"LOOKUP($B$62,$47:$47,olap_km_bld!50:50)","v":21835},{"$f":"LOOKUP($C$62,$47:$47,olap_km_bld!50:50)","v":21495},{"$f":"B63*100/$B$72","v":3.6041701742744618},{"$f":"IF(Auswahl_Jahr<2002,0,B63-C63)","v":340},{"$f":"IF(Auswahl_Jahr<2002,0,(B63*100/C63)-100)","v":1.5817632007443621},7.9,13700,"B",{"$f":"D63","v":3.6041701742744618},{"$f":"IF($A63=Auswahl_Bundesland,E63,\" \")","v":340},{"$f":"IF(AND(Auswahl_Jahr<>1980,$A63=Auswahl_Bundesland),F63,NA())","v":1.5817632007443621},{"$f":"IF(K63<>0,K63,NA())","v":340},{"$f":"IF(AND(MAX(E63:E71)>MIN(E63:E71)*-1,MIN(E63:E71)<0),MAX(E63:E71),IF(AND(MAX(E63:E71)<MIN(E63:E71)*-1,MAX(E63:E71)>0),MIN(E63:E71),0))","v":0},{"$f":"IF(AND(MAX(F63:F71)>MIN(F63:F71)*-1,MIN(F63:F71)<0),MAX(F63:F71),IF(AND(MAX(F63:F71)<MIN(F63:F71)*-1,MAX(F63:F71)>0),MIN(F63:F71),0))","v":0}]
["Kärnten",{"$f":"LOOKUP($B$62,$47:$47,olap_km_bld!51:51)","v":39384},{"$f":"LOOKUP($C$62,$47:$47,olap_km_bld!51:51)","v":38265},{"$f":"B64*100/$B$72","v":6.5008764892890039},1119,2.9243433947471544,5.0999999999999899,5500,"K",{"$f":"D64","v":6.5008764892890039}," ",{"$error":"#N/A"},{"$f":"IF(K64<>0,K64,NA())","v":" "},"Min_Veraend_abs","Min_Veraend_Proz"]
["Niederösterreich",{"$f":"LOOKUP($B$62,$47:$47,olap_km_bld!52:52)","v":118550},{"$f":"LOOKUP($C$62,$47:$47,olap_km_bld!52:52)","v":116166},19.568324898568235,2384,2.0522355938914956,6.75,22000,"NÖ",19.568324898568235," ",{"$error":"#N/A"}," ",{"$f":"N63*-1","v":0},{"$f":"O63*-1","v":0}]
["Oberösterreich",{"$f":"LOOKUP($B$62,$47:$47,olap_km_bld!53:53)","v":91092},{"$f":"LOOKUP($C$62,$47:$47,olap_km_bld!53:53)","v":88944},15.036000435768687,2148,2.4150026983270436,5.0999999999999899,19500,"OÖ",15.036000435768687," ",{"$error":"#N/A"}," "]
["Salzburg",{"$f":"LOOKUP($B$62,$47:$47,olap_km_bld!54:54)","v":42261},{"$f":"LOOKUP($C$62,$47:$47,olap_km_bld!54:54)","v":41632},6.97576531875489,629,1.5108570330514937,4.25,11000,"S",6.97576531875489," ",{"$error":"#N/A"}," "]
["Steiermark",{"$f":"LOOKUP($B$62,$47:$47,olap_km_bld!55:55)","v":86559},{"$f":"LOOKUP($C$62,$47:$47,olap_km_bld!55:55)","v":85466},14.287765794138911,1093,1.2788711300400166,6.25,12000,"ST",14.287765794138911," ",{"$error":"#N/A"}," "]
["Tirol",{"$f":"LOOKUP($B$62,$47:$47,olap_km_bld!56:56)","v":53184},{"$f":"LOOKUP($C$62,$47:$47,olap_km_bld!56:56)","v":52161},8.7787582573214085,1023,1.9612354057629204,2.25,10500,"T",8.7787582573214085," ",{"$error":"#N/A"}," "]
["Vorarlberg",{"$f":"LOOKUP($B$62,$47:$47,olap_km_bld!57:57)","v":25706},{"$f":"LOOKUP($C$62,$47:$47,olap_km_bld!57:57)","v":25121},4.2431325165971749,585,2.3287289518729324,0.8,11000,"V",4.2431325165971749," ",{"$error":"#N/A"}," "]
["Wien",{"$f":"LOOKUP($B$62,$47:$47,olap_km_bld!58:58)","v":127255},{"$f":"LOOKUP($C$62,$47:$47,olap_km_bld!58:58)","v":124389},21.005206115287226,2866,2.3040622563088391,7.75,20000,"W",21.005206115287226," ",{"$error":"#N/A"}," "]
["Österreich",{"$f":"LOOKUP($B$62,$47:$47,olap_km_bld!59:59)","v":605826},{"$f":"LOOKUP($C$62,$47:$47,olap_km_bld!59:59)","v":593639},100,{"$f":"IF(ISERROR(TEXT(IF(Auswahl_Jahr<2002,0,B72-C72),\"#.###\")),TEXT(IF(Auswahl_Jahr<2002,0,B72-C72),\"# ###\"),TEXT(IF(Auswahl_Jahr<2002,0,B72-C72),\"#.###\"))","v":"12.187"},{"$f":"TEXT(IF(Auswahl_Jahr<2002,0,(B72*100/C72)-100),\"##0,0\")","v":"2,1"},2.25,20000,null,null,{"$f":"B72-C72","v":12187},{"$f":"(B72*100/C72)-100","v":2.05293115849868},12187]
[null,null,null,null,null,null,null,null,null,null,{"$f":"B73-C73","v":0}]
[{"$f":"Auswahl_Bundesland","v":"Burgenland"},{"$f":"VLOOKUP($A$74,$A$63:$H$72,2,FALSE)","v":21835},{"$f":"VLOOKUP($A$74,$A$63:$H$72,3,FALSE)","v":21495},null,{"$f":"IF(ISERROR(TEXT(VLOOKUP($A$74,$A$63:$H$72,5,FALSE),\"#.###\")),TEXT(VLOOKUP($A$74,$A$63:$H$72,5,FALSE),\"# ###\"),TEXT(VLOOKUP($A$74,$A$63:$H$72,5,FALSE),\"#.###\"))","v":"340"},{"$f":"TEXT(VLOOKUP($A$74,$A$63:$H$72,6,FALSE),\"##0,0\")","v":"1,6"},{"$f":"VLOOKUP($A$74,$A$63:$H$72,7,FALSE)","v":7.9},{"$f":"VLOOKUP($A$74,$A$63:$H$72,8,FALSE)","v":13700},null,null,340,{"$f":"(B74*100/C74)-100","v":1.5817632007443621}]
[]
[{"$f":"Status & \" Kammermitglieder nach Bezirken in \" & Auswahl_Bundesland & \" \" & Auswahl_Jahr","v":"Aktive Kammermitglieder nach Bezirken in Burgenland 2025"}]
[{"$f":"\"Anteil in Prozent\"","v":"Anteil in Prozent"}]
[{"$f":"\"Absolute und prozentuelle Veränderung\"","v":"Absolute und prozentuelle Veränderung"}]
[{"$f":"Status & \" Kammermitglieder nach Bezirken in \" & Auswahl_Bundesland & \" \" & Auswahl_Jahr","v":"Aktive Kammermitglieder nach Bezirken in Burgenland 2025"}]
[{"$f":"IF(Auswahl_Jahr>=2002,\"\",\"Für den Stichtag 31.12.2001 kann keine Veränderung berechnet werden, da uns Zahlen aus früheren Jahren elektronisch nicht zur Verfügung stehen.\")","v":""}]
[]
["Anteil absteigend sortiert für Kreisdiagramm - mittels Formel"]
[1,{"$f":"INDEX($I$63:$J$71,MATCH(LARGE($J$63:$J$71,A83),$J$63:$J$71,0),1)","v":"W"},{"$f":"INDEX($I$63:$J$71,MATCH(LARGE($J$63:$J$71,A83),$J$63:$J$71,0),2)","v":21.005206115287226}]
[2,{"$f":"INDEX($I$63:$J$71,MATCH(LARGE($J$63:$J$71,A84),$J$63:$J$71,0),1)","v":"NÖ"},{"$f":"INDEX($I$63:$J$71,MATCH(LARGE($J$63:$J$71,A84),$J$63:$J$71,0),2)","v":19.568324898568235}]
[3,"OÖ",15.036000435768687]
[4,"ST",14.287765794138911]
[5,"T",8.7787582573214085]
[6,"S",6.97576531875489]
[7,"K",6.5008764892890039]
[8,"V",4.2431325165971749]
[9,"B",3.6041701742744618]

{"sheet":"olap_bm_auswahl","index":4,"n_rows":69,"n_cols":28,"rows_kept":69,"cut":false,"hidden":true,"merged":[]}
[{"$f":"IF(Auswahl_Bundesland=\"Burgenland\",Dropdown_Bundesland!$G3,IF(Auswahl_Bundesland=\"Kärnten\",Dropdown_Bundesland!$H3,IF(Auswahl_Bundesland=\"Niederösterreich\",Dropdown_Bundesland!$I3,IF(Auswahl_Bundesland=\"Oberösterreich\",Dropdown_Bundesland!$J3,IF(Auswahl_Bundesland=\"Salzburg\",Dropdown_Bundesland!$K3,IF(AND(Auswahl_Bundesland=\"Steiermark\",Auswahl_Jahr>2012),Dropdown_Bundesland!$L3,IF(AND(Auswahl_Bundesland=\"Steiermark\",Auswahl_Jahr<2012),Dropdown_Bundesland!$P3,IF(AND(Auswahl_Bundesland=\"Steiermark\",Auswahl_Jahr=2012),Dropdown_Bundesland!$Q3,IF(Auswahl_Bundesland=\"Tirol\",Dropdown_Bundesland!$M3,IF(Auswahl_Bundesland=\"Vorarlberg\",Dropdown_Bundesland!$N3,IF(Auswahl_Bundesland=\"Wien\",Dropdown_Bundesland!$O3,\"\")))))))))))","v":7},null,null,7,8,9,10,11,12,13,14,15,16,17,18,19,20,21,22,23,24,25,26,27,28,29,30,31]
[null,null,"Bez_STAT",2001,2002,2003,2004,2005,2006,2007,2008,2009,2010,2011,2012,2013,2014,2015,2016,2017,2018,2019,2020,2021,2022,2023,2024,2025]
[{"$f":"VLOOKUP(Status&Auswahl_Bundesland&C3,matrix_olap_bm,2,FALSE)","v":4},1,{"$f":"IF(Auswahl_Bundesland=\"Burgenland\",LOOKUP(B3,Dropdown_Bundesland!$F:$F,Dropdown_Bundesland!$G:$G),IF(Auswahl_Bundesland=\"Kärnten\",LOOKUP(B3,Dropdown_Bundesland!$F:$F,Dropdown_Bundesland!$H:$H),IF(AND(Auswahl_Bundesland=\"Niederösterreich\",Auswahl_Jahr>=2017),LOOKUP(B3,Dropdown_Bundesland!$F:$F,Dropdown_Bundesland!$R:$R),IF(AND(Auswahl_Bundesland=\"Niederösterreich\",Auswahl_Jahr<=2016),LOOKUP(B3,Dropdown_Bundesland!$F:$F,Dropdown_Bundesland!$I:$I),IF(Auswahl_Bundesland=\"Oberösterreich\",LOOKUP(B3,Dropdown_Bundesland!$F:$F,Dropdown_Bundesland!$J:$J),IF(Auswahl_Bundesland=\"Salzburg\",LOOKUP(B3,Dropdown_Bundesland!$F:$F,Dropdown_Bundesland!$K:$K),IF(AND(Auswahl_Bundesland=\"Steiermark\",Auswahl_Jahr>2012),LOOKUP(B3,Dropdown_Bundesland!$F:$F,Dropdown_Bundesland!$L:$L),IF(AND(Auswahl_Bundesland=\"Steiermark\",Auswahl_Jahr<2012),LOOKUP(B3,Dropdown_Bundesland!$F:$F,Dropdown_Bundesland!$P:$P),IF(AND(Auswahl_Bundesland=\"Steiermark\",Auswahl_Jahr=2012),LOOKUP(B3,Dropdown_Bundesland!$F:$F,Dropdown_Bundesland!$Q:$Q),IF(Auswahl_Bundesland=\"Tirol\",LOOKUP(B3,Dropdown_Bundesland!$F:$F,Dropdown_Bundesland!$M:$M),IF(Auswahl_Bundesland=\"Vorarlberg\",LOOKUP(B3,Dropdown_Bundesland!$F:$F,Dropdown_Bundesland!$N:$N),IF(Auswahl_Bundesland=\"Wien\",LOOKUP(B3,Dropdown_Bundesland!$F:$F,Dropdown_Bundesland!$O:$O),\"\"))))))))))))","v":"Eisenstadt-Umgebung"},{"$f":"IF(ISERROR($A3),0,IF(INDEX(matrix_olap_bm,$A3,D$1)=0,\".\",INDEX(matrix_olap_bm,$A3,D$1)))","v":2241},2344,2442,2589,2703,2745,2818,3116,3286,3521,3627,3677,3801,3870,4007,4054,4095,4181,4289,4311,4498,4506,4542,4618,{"$f":"IF(ISERROR($A3),0,IF(INDEX(matrix_olap_bm,$A3,AB$1)=0,\".\",INDEX(matrix_olap_bm,$A3,AB$1)))","v":4713}]
[{"$f":"VLOOKUP(Status&Auswahl_Bundesland&C4,matrix_olap_bm,2,FALSE)","v":5},2,{"$f":"IF(Auswahl_Bundesland=\"Burgenland\",LOOKUP(B4,Dropdown_Bundesland!$F:$F,Dropdown_Bundesland!$G:$G),IF(Auswahl_Bundesland=\"Kärnten\",LOOKUP(B4,Dropdown_Bundesland!$F:$F,Dropdown_Bundesland!$H:$H),IF(AND(Auswahl_Bundesland=\"Niederösterreich\",Auswahl_Jahr>=2017),LOOKUP(B4,Dropdown_Bundesland!$F:$F,Dropdown_Bundesland!$R:$R),IF(AND(Auswahl_Bundesland=\"Niederösterreich\",Auswahl_Jahr<=2016),LOOKUP(B4,Dropdown_Bundesland!$F:$F,Dropdown_Bundesland!$I:$I),IF(Auswahl_Bundesland=\"Oberösterreich\",LOOKUP(B4,Dropdown_Bundesland!$F:$F,Dropdown_Bundesland!$J:$J),IF(Auswahl_Bundesland=\"Salzburg\",LOOKUP(B4,Dropdown_Bundesland!$F:$F,Dropdown_Bundesland!$K:$K),IF(AND(Auswahl_Bundesland=\"Steiermark\",Auswahl_Jahr>2012),LOOKUP(B4,Dropdown_Bundesland!$F:$F,Dropdown_Bundesland!$L:$L),IF(AND(Auswahl_Bundesland=\"Steiermark\",Auswahl_Jahr<2012),LOOKUP(B4,Dropdown_Bundesland!$F:$F,Dropdown_Bundesland!$P:$P),IF(AND(Auswahl_Bundesland=\"Steiermark\",Auswahl_Jahr=2012),LOOKUP(B4,Dropdown_Bundesland!$F:$F,Dropdown_Bundesland!$Q:$Q),IF(Auswahl_Bundesland=\"Tirol\",LOOKUP(B4,Dropdown_Bundesland!$F:$F,Dropdown_Bundesland!$M:$M),IF(Auswahl_Bundesland=\"Vorarlberg\",LOOKUP(B4,Dropdown_Bundesland!$F:$F,Dropdown_Bundesland!$N:$N),IF(Auswahl_Bundesland=\"Wien\",LOOKUP(B4,Dropdown_Bundesland!$F:$F,Dropdown_Bundesland!$O:$O),\"\"))))))))))))","v":"Neusiedl am See"},1903,2013,2115,2203,2304,2330,2447,2632,2768,2976,3132,3373,3493,3638,3741,3968,4035,4210,4246,4332,4415,4593,4654,4685,4718]
[6,3,{"$f":"IF(Auswahl_Bundesland=\"Burgenland\",LOOKUP(B5,Dropdown_Bundesland!$F:$F,Dropdown_Bundesland!$G:$G),IF(Auswahl_Bundesland=\"Kärnten\",LOOKUP(B5,Dropdown_Bundesland!$F:$F,Dropdown_Bundesland!$H:$H),IF(AND(Auswahl_Bundesland=\"Niederösterreich\",Auswahl_Jahr>=2017),LOOKUP(B5,Dropdown_Bundesland!$F:$F,Dropdown_Bundesland!$R:$R),IF(AND(Auswahl_Bundesland=\"Niederösterreich\",Auswahl_Jahr<=2016),LOOKUP(B5,Dropdown_Bundesland!$F:$F,Dropdown_Bundesland!$I:$I),IF(Auswahl_Bundesland=\"Oberösterreich\",LOOKUP(B5,Dropdown_Bundesland!$F:$F,Dropdown_Bundesland!$J:$J),IF(Auswahl_Bundesland=\"Salzburg\",LOOKUP(B5,Dropdown_Bundesland!$F:$F,Dropdown_Bundesland!$K:$K),IF(AND(Auswahl_Bundesland=\"Steiermark\",Auswahl_Jahr>2012),LOOKUP(B5,Dropdown_Bundesland!$F:$F,Dropdown_Bundesland!$L:$L),IF(AND(Auswahl_Bundesland=\"Steiermark\",Auswahl_Jahr<2012),LOOKUP(B5,Dropdown_Bundesland!$F:$F,Dropdown_Bundesland!$P:$P),IF(AND(Auswahl_Bundesland=\"Steiermark\",Auswahl_Jahr=2012),LOOKUP(B5,Dropdown_Bundesland!$F:$F,Dropdown_Bundesland!$Q:$Q),IF(Auswahl_Bundesland=\"Tirol\",LOOKUP(B5,Dropdown_Bundesland!$F:$F,Dropdown_Bundesland!$M:$M),IF(Auswahl_Bundesland=\"Vorarlberg\",LOOKUP(B5,Dropdown_Bundesland!$F:$F,Dropdown_Bundesland!$N:$N),IF(Auswahl_Bundesland=\"Wien\",LOOKUP(B5,Dropdown_Bundesland!$F:$F,Dropdown_Bundesland!$O:$O),\"\"))))))))))))","v":"Mattersburg"},1386,1419,1459,1494,1579,1647,1702,1818,1919,2026,2025,2068,2116,2219,2250,2322,2352,2413,2435,2487,2554,2598,2600,2662,2751]
[7,4,{"$f":"IF(Auswahl_Bundesland=\"Burgenland\",LOOKUP(B6,Dropdown_Bundesland!$F:$F,Dropdown_Bundesland!$G:$G),IF(Auswahl_Bundesland=\"Kärnten\",LOOKUP(B6,Dropdown_Bundesland!$F:$F,Dropdown_Bundesland!$H:$H),IF(AND(Auswahl_Bundesland=\"Niederösterreich\",Auswahl_Jahr>=2017),LOOKUP(B6,Dropdown_Bundesland!$F:$F,Dropdown_Bundesland!$R:$R),IF(AND(Auswahl_Bundesland=\"Niederösterreich\",Auswahl_Jahr<=2016),LOOKUP(B6,Dropdown_Bundesland!$F:$F,Dropdown_Bundesland!$I:$I),IF(Auswahl_Bundesland=\"Oberösterreich\",LOOKUP(B6,Dropdown_Bundesland!$F:$F,Dropdown_Bundesland!$J:$J),IF(Auswahl_Bundesland=\"Salzburg\",LOOKUP(B6,Dropdown_Bundesland!$F:$F,Dropdown_Bundesland!$K:$K),IF(AND(Auswahl_Bundesland=\"Steiermark\",Auswahl_Jahr>2012),LOOKUP(B6,Dropdown_Bundesland!$F:$F,Dropdown_Bundesland!$L:$L),IF(AND(Auswahl_Bundesland=\"Steiermark\",Auswahl_Jahr<2012),LOOKUP(B6,Dropdown_Bundesland!$F:$F,Dropdown_Bundesland!$P:$P),IF(AND(Auswahl_Bundesland=\"Steiermark\",Auswahl_Jahr=2012),LOOKUP(B6,Dropdown_Bundesland!$F:$F,Dropdown_Bundesland!$Q:$Q),IF(Auswahl_Bundesland=\"Tirol\",LOOKUP(B6,Dropdown_Bundesland!$F:$F,Dropdown_Bundesland!$M:$M),IF(Auswahl_Bundesland=\"Vorarlberg\",LOOKUP(B6,Dropdown_Bundesland!$F:$F,Dropdown_Bundesland!$N:$N),IF(Auswahl_Bundesland=\"Wien\",LOOKUP(B6,Dropdown_Bundesland!$F:$F,Dropdown_Bundesland!$O:$O),\"\"))))))))))))","v":"Oberpullendorf"},1373,1340,1402,1470,1498,1574,1580,1735,1794,1894,2011,2061,2067,2182,2230,2317,2297,2355,2399,2486,2536,2626,2669,2692,2785]
[8,5,{"$f":"IF(Auswahl_Bundesland=\"Burgenland\",LOOKUP(B7,Dropdown_Bundesland!$F:$F,Dropdown_Bundesland!$G:$G),IF(Auswahl_Bundesland=\"Kärnten\",LOOKUP(B7,Dropdown_Bundesland!$F:$F,Dropdown_Bundesland!$H:$H),IF(AND(Auswahl_Bundesland=\"Niederösterreich\",Auswahl_Jahr>=2017),LOOKUP(B7,Dropdown_Bundesland!$F:$F,Dropdown_Bundesland!$R:$R),IF(AND(Auswahl_Bundesland=\"Niederösterreich\",Auswahl_Jahr<=2016),LOOKUP(B7,Dropdown_Bundesland!$F:$F,Dropdown_Bundesland!$I:$I),IF(Auswahl_Bundesland=\"Oberösterreich\",LOOKUP(B7,Dropdown_Bundesland!$F:$F,Dropdown_Bundesland!$J:$J),IF(Auswahl_Bundesland=\"Salzburg\",LOOKUP(B7,Dropdown_Bundesland!$F:$F,Dropdown_Bundesland!$K:$K),IF(AND(Auswahl_Bundesland=\"Steiermark\",Auswahl_Jahr>2012),LOOKUP(B7,Dropdown_Bundesland!$F:$F,Dropdown_Bundesland!$L:$L),IF(AND(Auswahl_Bundesland=\"Steiermark\",Auswahl_Jahr<2012),LOOKUP(B7,Dropdown_Bundesland!$F:$F,Dropdown_Bundesland!$P:$P),IF(AND(Auswahl_Bundesland=\"Steiermark\",Auswahl_Jahr=2012),LOOKUP(B7,Dropdown_Bundesland!$F:$F,Dropdown_Bundesland!$Q:$Q),IF(Auswahl_Bundesland=\"Tirol\",LOOKUP(B7,Dropdown_Bundesland!$F:$F,Dropdown_Bundesland!$M:$M),IF(Auswahl_Bundesland=\"Vorarlberg\",LOOKUP(B7,Dropdown_Bundesland!$F:$F,Dropdown_Bundesland!$N:$N),IF(Auswahl_Bundesland=\"Wien\",LOOKUP(B7,Dropdown_Bundesland!$F:$F,Dropdown_Bundesland!$O:$O),\"\"))))))))))))","v":"Oberwart"},1926,1998,2072,2131,2224,2296,2372,2611,2728,2901,3092,3211,3253,3283,3343,3368,3439,3560,3678,3772,3816,3845,3992,{"$f":"IF(ISERROR($A7),0,IF(INDEX(matrix_olap_bm,$A7,AA$1)=0,\".\",INDEX(matrix_olap_bm,$A7,AA$1)))","v":3994},3942]
[9,6,{"$f":"IF(Auswahl_Bundesland=\"Burgenland\",LOOKUP(B8,Dropdown_Bundesland!$F:$F,Dropdown_Bundesland!$G:$G),IF(Auswahl_Bundesland=\"Kärnten\",LOOKUP(B8,Dropdown_Bundesland!$F:$F,Dropdown_Bundesland!$H:$H),IF(AND(Auswahl_Bundesland=\"Niederösterreich\",Auswahl_Jahr>=2017),LOOKUP(B8,Dropdown_Bundesland!$F:$F,Dropdown_Bundesland!$R:$R),IF(AND(Auswahl_Bundesland=\"Niederösterreich\",Auswahl_Jahr<=2016),LOOKUP(B8,Dropdown_Bundesland!$F:$F,Dropdown_Bundesland!$I:$I),IF(Auswahl_Bundesland=\"Oberösterreich\",LOOKUP(B8,Dropdown_Bundesland!$F:$F,Dropdown_Bundesland!$J:$J),IF(Auswahl_Bundesland=\"Salzburg\",LOOKUP(B8,Dropdown_Bundesland!$F:$F,Dropdown_Bundesland!$K:$K),IF(AND(Auswahl_Bundesland=\"Steiermark\",Auswahl_Jahr>2012),LOOKUP(B8,Dropdown_Bundesland!$F:$F,Dropdown_Bundesland!$L:$L),IF(AND(Auswahl_Bundesland=\"Steiermark\",Auswahl_Jahr<2012),LOOKUP(B8,Dropdown_Bundesland!$F:$F,Dropdown_Bundesland!$P:$P),IF(AND(Auswahl_Bundesland=\"Steiermark\",Auswahl_Jahr=2012),LOOKUP(B8,Dropdown_Bundesland!$F:$F,Dropdown_Bundesland!$Q:$Q),IF(Auswahl_Bundesland=\"Tirol\",LOOKUP(B8,Dropdown_Bundesland!$F:$F,Dropdown_Bundesland!$M:$M),IF(Auswahl_Bundesland=\"Vorarlberg\",LOOKUP(B8,Dropdown_Bundesland!$F:$F,Dropdown_Bundesland!$N:$N),IF(Auswahl_Bundesland=\"Wien\",LOOKUP(B8,Dropdown_Bundesland!$F:$F,Dropdown_Bundesland!$O:$O),\"\"))))))))))))","v":"Güssing"},843,905,949,1025,1057,1097,1141,1223,1279,1371,1409,1512,1590,1708,1832,1883,1902,1917,1925,1890,1876,1816,1798,1777,1796]
[10,7,{"$f":"IF(Auswahl_Bundesland=\"Burgenland\",LOOKUP(B9,Dropdown_Bundesland!$F:$F,Dropdown_Bundesland!$G:$G),IF(Auswahl_Bundesland=\"Kärnten\",LOOKUP(B9,Dropdown_Bundesland!$F:$F,Dropdown_Bundesland!$H:$H),IF(AND(Auswahl_Bundesland=\"Niederösterreich\",Auswahl_Jahr>=2017),LOOKUP(B9,Dropdown_Bundesland!$F:$F,Dropdown_Bundesland!$R:$R),IF(AND(Auswahl_Bundesland=\"Niederösterreich\",Auswahl_Jahr<=2016),LOOKUP(B9,Dropdown_Bundesland!$F:$F,Dropdown_Bundesland!$I:$I),IF(Auswahl_Bundesland=\"Oberösterreich\",LOOKUP(B9,Dropdown_Bundesland!$F:$F,Dropdown_Bundesland!$J:$J),IF(Auswahl_Bundesland=\"Salzburg\",LOOKUP(B9,Dropdown_Bundesland!$F:$F,Dropdown_Bundesland!$K:$K),IF(AND(Auswahl_Bundesland=\"Steiermark\",Auswahl_Jahr>2012),LOOKUP(B9,Dropdown_Bundesland!$F:$F,Dropdown_Bundesland!$L:$L),IF(AND(Auswahl_Bundesland=\"Steiermark\",Auswahl_Jahr<2012),LOOKUP(B9,Dropdown_Bundesland!$F:$F,Dropdown_Bundesland!$P:$P),IF(AND(Auswahl_Bundesland=\"Steiermark\",Auswahl_Jahr=2012),LOOKUP(B9,Dropdown_Bundesland!$F:$F,Dropdown_Bundesland!$Q:$Q),IF(Auswahl_Bundesland=\"Tirol\",LOOKUP(B9,Dropdown_Bundesland!$F:$F,Dropdown_Bundesland!$M:$M),IF(Auswahl_Bundesland=\"Vorarlberg\",LOOKUP(B9,Dropdown_Bundesland!$F:$F,Dropdown_Bundesland!$N:$N),IF(Auswahl_Bundesland=\"Wien\",LOOKUP(B9,Dropdown_Bundesland!$F:$F,Dropdown_Bundesland!$O:$O),\"\"))))))))))))","v":"Jennersdorf"},557,580,609,605,622,653,697,743,771,821,861,891,899,939,1075,1180,1256,1276,1328,1335,1399,1507,1514,1609,1663]
[{"$error":"#N/A"},8,{"$f":"IF(Auswahl_Bundesland=\"Burgenland\",LOOKUP(B10,Dropdown_Bundesland!$F:$F,Dropdown_Bundesland!$G:$G),IF(Auswahl_Bundesland=\"Kärnten\",LOOKUP(B10,Dropdown_Bundesland!$F:$F,Dropdown_Bundesland!$H:$H),IF(AND(Auswahl_Bundesland=\"Niederösterreich\",Auswahl_Jahr>=2017),LOOKUP(B10,Dropdown_Bundesland!$F:$F,Dropdown_Bundesland!$R:$R),IF(AND(Auswahl_Bundesland=\"Niederösterreich\",Auswahl_Jahr<=2016),LOOKUP(B10,Dropdown_Bundesland!$F:$F,Dropdown_Bundesland!$I:$I),IF(Auswahl_Bundesland=\"Oberösterreich\",LOOKUP(B10,Dropdown_Bundesland!$F:$F,Dropdown_Bundesland!$J:$J),IF(Auswahl_Bundesland=\"Salzburg\",LOOKUP(B10,Dropdown_Bundesland!$F:$F,Dropdown_Bundesland!$K:$K),IF(AND(Auswahl_Bundesland=\"Steiermark\",Auswahl_Jahr>2012),LOOKUP(B10,Dropdown_Bundesland!$F:$F,Dropdown_Bundesland!$L:$L),IF(AND(Auswahl_Bundesland=\"Steiermark\",Auswahl_Jahr<2012),LOOKUP(B10,Dropdown_Bundesland!$F:$F,Dropdown_Bundesland!$P:$P),IF(AND(Auswahl_Bundesland=\"Steiermark\",Auswahl_Jahr=2012),LOOKUP(B10,Dropdown_Bundesland!$F:$F,Dropdown_Bundesland!$Q:$Q),IF(Auswahl_Bundesland=\"Tirol\",LOOKUP(B10,Dropdown_Bundesland!$F:$F,Dropdown_Bundesland!$M:$M),IF(Auswahl_Bundesland=\"Vorarlberg\",LOOKUP(B10,Dropdown_Bundesland!$F:$F,Dropdown_Bundesland!$N:$N),IF(Auswahl_Bundesland=\"Wien\",LOOKUP(B10,Dropdown_Bundesland!$F:$F,Dropdown_Bundesland!$O:$O),\"\"))))))))))))","v":0},0,0,0,0,0,0,0,0,0,0,0,0,0,0,0,0,0,0,0,0,0,0,0,0,0]
[{"$error":"#N/A"},9,{"$f":"IF(Auswahl_Bundesland=\"Burgenland\",LOOKUP(B11,Dropdown_Bundesland!$F:$F,Dropdown_Bundesland!$G:$G),IF(Auswahl_Bundesland=\"Kärnten\",LOOKUP(B11,Dropdown_Bundesland!$F:$F,Dropdown_Bundesland!$H:$H),IF(AND(Auswahl_Bundesland=\"Niederösterreich\",Auswahl_Jahr>=2017),LOOKUP(B11,Dropdown_Bundesland!$F:$F,Dropdown_Bundesland!$R:$R),IF(AND(Auswahl_Bundesland=\"Niederösterreich\",Auswahl_Jahr<=2016),LOOKUP(B11,Dropdown_Bundesland!$F:$F,Dropdown_Bundesland!$I:$I),IF(Auswahl_Bundesland=\"Oberösterreich\",LOOKUP(B11,Dropdown_Bundesland!$F:$F,Dropdown_Bundesland!$J:$J),IF(Auswahl_Bundesland=\"Salzburg\",LOOKUP(B11,Dropdown_Bundesland!$F:$F,Dropdown_Bundesland!$K:$K),IF(AND(Auswahl_Bundesland=\"Steiermark\",Auswahl_Jahr>2012),LOOKUP(B11,Dropdown_Bundesland!$F:$F,Dropdown_Bundesland!$L:$L),IF(AND(Auswahl_Bundesland=\"Steiermark\",Auswahl_Jahr<2012),LOOKUP(B11,Dropdown_Bundesland!$F:$F,Dropdown_Bundesland!$P:$P),IF(AND(Auswahl_Bundesland=\"Steiermark\",Auswahl_Jahr=2012),LOOKUP(B11,Dropdown_Bundesland!$F:$F,Dropdown_Bundesland!$Q:$Q),IF(Auswahl_Bundesland=\"Tirol\",LOOKUP(B11,Dropdown_Bundesland!$F:$F,Dropdown_Bundesland!$M:$M),IF(Auswahl_Bundesland=\"Vorarlberg\",LOOKUP(B11,Dropdown_Bundesland!$F:$F,Dropdown_Bundesland!$N:$N),IF(Auswahl_Bundesland=\"Wien\",LOOKUP(B11,Dropdown_Bundesland!$F:$F,Dropdown_Bundesland!$O:$O),\"\"))))))))))))","v":0},0,0,0,0,0,0,0,0,0,0,0,0,0,0,0,0,0,0,0,0,0,0,0,0,0]
[{"$error":"#N/A"},10,{"$f":"IF(Auswahl_Bundesland=\"Burgenland\",LOOKUP(B12,Dropdown_Bundesland!$F:$F,Dropdown_Bundesland!$G:$G),IF(Auswahl_Bundesland=\"Kärnten\",LOOKUP(B12,Dropdown_Bundesland!$F:$F,Dropdown_Bundesland!$H:$H),IF(AND(Auswahl_Bundesland=\"Niederösterreich\",Auswahl_Jahr>=2017),LOOKUP(B12,Dropdown_Bundesland!$F:$F,Dropdown_Bundesland!$R:$R),IF(AND(Auswahl_Bundesland=\"Niederösterreich\",Auswahl_Jahr<=2016),LOOKUP(B12,Dropdown_Bundesland!$F:$F,Dropdown_Bundesland!$I:$I),IF(Auswahl_Bundesland=\"Oberösterreich\",LOOKUP(B12,Dropdown_Bundesland!$F:$F,Dropdown_Bundesland!$J:$J),IF(Auswahl_Bundesland=\"Salzburg\",LOOKUP(B12,Dropdown_Bundesland!$F:$F,Dropdown_Bundesland!$K:$K),IF(AND(Auswahl_Bundesland=\"Steiermark\",Auswahl_Jahr>2012),LOOKUP(B12,Dropdown_Bundesland!$F:$F,Dropdown_Bundesland!$L:$L),IF(AND(Auswahl_Bundesland=\"Steiermark\",Auswahl_Jahr<2012),LOOKUP(B12,Dropdown_Bundesland!$F:$F,Dropdown_Bundesland!$P:$P),IF(AND(Auswahl_Bundesland=\"Steiermark\",Auswahl_Jahr=2012),LOOKUP(B12,Dropdown_Bundesland!$F:$F,Dropdown_Bundesland!$Q:$Q),IF(Auswahl_Bundesland=\"Tirol\",LOOKUP(B12,Dropdown_Bundesland!$F:$F,Dropdown_Bundesland!$M:$M),IF(Auswahl_Bundesland=\"Vorarlberg\",LOOKUP(B12,Dropdown_Bundesland!$F:$F,Dropdown_Bundesland!$N:$N),IF(Auswahl_Bundesland=\"Wien\",LOOKUP(B12,Dropdown_Bundesland!$F:$F,Dropdown_Bundesland!$O:$O),\"\"))))))))))))","v":0},0,0,0,0,0,0,0,0,0,0,0,0,0,0,0,0,0,0,0,0,0,0,0,0,0]
[{"$error":"#N/A"},11,{"$f":"IF(Auswahl_Bundesland=\"Burgenland\",LOOKUP(B13,Dropdown_Bundesland!$F:$F,Dropdown_Bundesland!$G:$G),IF(Auswahl_Bundesland=\"Kärnten\",LOOKUP(B13,Dropdown_Bundesland!$F:$F,Dropdown_Bundesland!$H:$H),IF(AND(Auswahl_Bundesland=\"Niederösterreich\",Auswahl_Jahr>=2017),LOOKUP(B13,Dropdown_Bundesland!$F:$F,Dropdown_Bundesland!$R:$R),IF(AND(Auswahl_Bundesland=\"Niederösterreich\",Auswahl_Jahr<=2016),LOOKUP(B13,Dropdown_Bundesland!$F:$F,Dropdown_Bundesland!$I:$I),IF(Auswahl_Bundesland=\"Oberösterreich\",LOOKUP(B13,Dropdown_Bundesland!$F:$F,Dropdown_Bundesland!$J:$J),IF(Auswahl_Bundesland=\"Salzburg\",LOOKUP(B13,Dropdown_Bundesland!$F:$F,Dropdown_Bundesland!$K:$K),IF(AND(Auswahl_Bundesland=\"Steiermark\",Auswahl_Jahr>2012),LOOKUP(B13,Dropdown_Bundesland!$F:$F,Dropdown_Bundesland!$L:$L),IF(AND(Auswahl_Bundesland=\"Steiermark\",Auswahl_Jahr<2012),LOOKUP(B13,Dropdown_Bundesland!$F:$F,Dropdown_Bundesland!$P:$P),IF(AND(Auswahl_Bundesland=\"Steiermark\",Auswahl_Jahr=2012),LOOKUP(B13,Dropdown_Bundesland!$F:$F,Dropdown_Bundesland!$Q:$Q),IF(Auswahl_Bundesland=\"Tirol\",LOOKUP(B13,Dropdown_Bundesland!$F:$F,Dropdown_Bundesland!$M:$M),IF(Auswahl_Bundesland=\"Vorarlberg\",LOOKUP(B13,Dropdown_Bundesland!$F:$F,Dropdown_Bundesland!$N:$N),IF(Auswahl_Bundesland=\"Wien\",LOOKUP(B13,Dropdown_Bundesland!$F:$F,Dropdown_Bundesland!$O:$O),\"\"))))))))))))","v":0},{"$f":"IF(ISERROR($A13),0,IF(INDEX(matrix_olap_bm,$A13,D$1)=0,\".\",INDEX(matrix_olap_bm,$A13,D$1)))","v":0},0,0,0,0,0,0,0,0,0,0,0,0,0,0,0,0,0,0,0,0,0,0,0,0]
[{"$error":"#N/A"},12,{"$f":"IF(Auswahl_Bundesland=\"Burgenland\",LOOKUP(B14,Dropdown_Bundesland!$F:$F,Dropdown_Bundesland!$G:$G),IF(Auswahl_Bundesland=\"Kärnten\",LOOKUP(B14,Dropdown_Bundesland!$F:$F,Dropdown_Bundesland!$H:$H),IF(AND(Auswahl_Bundesland=\"Niederösterreich\",Auswahl_Jahr>=2017),LOOKUP(B14,Dropdown_Bundesland!$F:$F,Dropdown_Bundesland!$R:$R),IF(AND(Auswahl_Bundesland=\"Niederösterreich\",Auswahl_Jahr<=2016),LOOKUP(B14,Dropdown_Bundesland!$F:$F,Dropdown_Bundesland!$I:$I),IF(Auswahl_Bundesland=\"Oberösterreich\",LOOKUP(B14,Dropdown_Bundesland!$F:$F,Dropdown_Bundesland!$J:$J),IF(Auswahl_Bundesland=\"Salzburg\",LOOKUP(B14,Dropdown_Bundesland!$F:$F,Dropdown_Bundesland!$K:$K),IF(AND(Auswahl_Bundesland=\"Steiermark\",Auswahl_Jahr>2012),LOOKUP(B14,Dropdown_Bundesland!$F:$F,Dropdown_Bundesland!$L:$L),IF(AND(Auswahl_Bundesland=\"Steiermark\",Auswahl_Jahr<2012),LOOKUP(B14,Dropdown_Bundesland!$F:$F,Dropdown_Bundesland!$P:$P),IF(AND(Auswahl_Bundesland=\"Steiermark\",Auswahl_Jahr=2012),LOOKUP(B14,Dropdown_Bundesland!$F:$F,Dropdown_Bundesland!$Q:$Q),IF(Auswahl_Bundesland=\"Tirol\",LOOKUP(B14,Dropdown_Bundesland!$F:$F,Dropdown_Bundesland!$M:$M),IF(Auswahl_Bundesland=\"Vorarlberg\",LOOKUP(B14,Dropdown_Bundesland!$F:$F,Dropdown_Bundesland!$N:$N),IF(Auswahl_Bundesland=\"Wien\",LOOKUP(B14,Dropdown_Bundesland!$F:$F,Dropdown_Bundesland!$O:$O),\"\"))))))))))))","v":0},0,0,0,0,0,0,0,0,0,0,0,0,0,0,0,0,0,0,0,0,0,0,0,0,0]
[{"$error":"#N/A"},13,{"$f":"IF(Auswahl_Bundesland=\"Burgenland\",LOOKUP(B15,Dropdown_Bundesland!$F:$F,Dropdown_Bundesland!$G:$G),IF(Auswahl_Bundesland=\"Kärnten\",LOOKUP(B15,Dropdown_Bundesland!$F:$F,Dropdown_Bundesland!$H:$H),IF(AND(Auswahl_Bundesland=\"Niederösterreich\",Auswahl_Jahr>=2017),LOOKUP(B15,Dropdown_Bundesland!$F:$F,Dropdown_Bundesland!$R:$R),IF(AND(Auswahl_Bundesland=\"Niederösterreich\",Auswahl_Jahr<=2016),LOOKUP(B15,Dropdown_Bundesland!$F:$F,Dropdown_Bundesland!$I:$I),IF(Auswahl_Bundesland=\"Oberösterreich\",LOOKUP(B15,Dropdown_Bundesland!$F:$F,Dropdown_Bundesland!$J:$J),IF(Auswahl_Bundesland=\"Salzburg\",LOOKUP(B15,Dropdown_Bundesland!$F:$F,Dropdown_Bundesland!$K:$K),IF(AND(Auswahl_Bundesland=\"Steiermark\",Auswahl_Jahr>2012),LOOKUP(B15,Dropdown_Bundesland!$F:$F,Dropdown_Bundesland!$L:$L),IF(AND(Auswahl_Bundesland=\"Steiermark\",Auswahl_Jahr<2012),LOOKUP(B15,Dropdown_Bundesland!$F:$F,Dropdown_Bundesland!$P:$P),IF(AND(Auswahl_Bundesland=\"Steiermark\",Auswahl_Jahr=2012),LOOKUP(B15,Dropdown_Bundesland!$F:$F,Dropdown_Bundesland!$Q:$Q),IF(Auswahl_Bundesland=\"Tirol\",LOOKUP(B15,Dropdown_Bundesland!$F:$F,Dropdown_Bundesland!$M:$M),IF(Auswahl_Bundesland=\"Vorarlberg\",LOOKUP(B15,Dropdown_Bundesland!$F:$F,Dropdown_Bundesland!$N:$N),IF(Auswahl_Bundesland=\"Wien\",LOOKUP(B15,Dropdown_Bundesland!$F:$F,Dropdown_Bundesland!$O:$O),\"\"))))))))))))","v":0},0,0,0,0,0,0,0,0,0,0,0,0,0,0,0,0,0,0,0,0,0,0,0,0,0]
[{"$error":"#N/A"},14,{"$f":"IF(Auswahl_Bundesland=\"Burgenland\",LOOKUP(B16,Dropdown_Bundesland!$F:$F,Dropdown_Bundesland!$G:$G),IF(Auswahl_Bundesland=\"Kärnten\",LOOKUP(B16,Dropdown_Bundesland!$F:$F,Dropdown_Bundesland!$H:$H),IF(AND(Auswahl_Bundesland=\"Niederösterreich\",Auswahl_Jahr>=2017),LOOKUP(B16,Dropdown_Bundesland!$F:$F,Dropdown_Bundesland!$R:$R),IF(AND(Auswahl_Bundesland=\"Niederösterreich\",Auswahl_Jahr<=2016),LOOKUP(B16,Dropdown_Bundesland!$F:$F,Dropdown_Bundesland!$I:$I),IF(Auswahl_Bundesland=\"Oberösterreich\",LOOKUP(B16,Dropdown_Bundesland!$F:$F,Dropdown_Bundesland!$J:$J),IF(Auswahl_Bundesland=\"Salzburg\",LOOKUP(B16,Dropdown_Bundesland!$F:$F,Dropdown_Bundesland!$K:$K),IF(AND(Auswahl_Bundesland=\"Steiermark\",Auswahl_Jahr>2012),LOOKUP(B16,Dropdown_Bundesland!$F:$F,Dropdown_Bundesland!$L:$L),IF(AND(Auswahl_Bundesland=\"Steiermark\",Auswahl_Jahr<2012),LOOKUP(B16,Dropdown_Bundesland!$F:$F,Dropdown_Bundesland!$P:$P),IF(AND(Auswahl_Bundesland=\"Steiermark\",Auswahl_Jahr=2012),LOOKUP(B16,Dropdown_Bundesland!$F:$F,Dropdown_Bundesland!$Q:$Q),IF(Auswahl_Bundesland=\"Tirol\",LOOKUP(B16,Dropdown_Bundesland!$F:$F,Dropdown_Bundesland!$M:$M),IF(Auswahl_Bundesland=\"Vorarlberg\",LOOKUP(B16,Dropdown_Bundesland!$F:$F,Dropdown_Bundesland!$N:$N),IF(Auswahl_Bundesland=\"Wien\",LOOKUP(B16,Dropdown_Bundesland!$F:$F,Dropdown_Bundesland!$O:$O),\"\"))))))))))))","v":0},0,0,0,0,0,0,0,0,0,0,0,0,0,0,0,0,0,0,{"$f":"IF(ISERROR($A16),0,IF(INDEX(matrix_olap_bm,$A16,V$1)=0,\".\",INDEX(matrix_olap_bm,$A16,V$1)))","v":0},0,0,0,0,0,0]
[{"$error":"#N/A"},15,{"$f":"IF(Auswahl_Bundesland=\"Burgenland\",LOOKUP(B17,Dropdown_Bundesland!$F:$F,Dropdown_Bundesland!$G:$G),IF(Auswahl_Bundesland=\"Kärnten\",LOOKUP(B17,Dropdown_Bundesland!$F:$F,Dropdown_Bundesland!$H:$H),IF(AND(Auswahl_Bundesland=\"Niederösterreich\",Auswahl_Jahr>=2017),LOOKUP(B17,Dropdown_Bundesland!$F:$F,Dropdown_Bundesland!$R:$R),IF(AND(Auswahl_Bundesland=\"Niederösterreich\",Auswahl_Jahr<=2016),LOOKUP(B17,Dropdown_Bundesland!$F:$F,Dropdown_Bundesland!$I:$I),IF(Auswahl_Bundesland=\"Oberösterreich\",LOOKUP(B17,Dropdown_Bundesland!$F:$F,Dropdown_Bundesland!$J:$J),IF(Auswahl_Bundesland=\"Salzburg\",LOOKUP(B17,Dropdown_Bundesland!$F:$F,Dropdown_Bundesland!$K:$K),IF(AND(Auswahl_Bundesland=\"Steiermark\",Auswahl_Jahr>2012),LOOKUP(B17,Dropdown_Bundesland!$F:$F,Dropdown_Bundesland!$L:$L),IF(AND(Auswahl_Bundesland=\"Steiermark\",Auswahl_Jahr<2012),LOOKUP(B17,Dropdown_Bundesland!$F:$F,Dropdown_Bundesland!$P:$P),IF(AND(Auswahl_Bundesland=\"Steiermark\",Auswahl_Jahr=2012),LOOKUP(B17,Dropdown_Bundesland!$F:$F,Dropdown_Bundesland!$Q:$Q),IF(Auswahl_Bundesland=\"Tirol\",LOOKUP(B17,Dropdown_Bundesland!$F:$F,Dropdown_Bundesland!$M:$M),IF(Auswahl_Bundesland=\"Vorarlberg\",LOOKUP(B17,Dropdown_Bundesland!$F:$F,Dropdown_Bundesland!$N:$N),IF(Auswahl_Bundesland=\"Wien\",LOOKUP(B17,Dropdown_Bundesland!$F:$F,Dropdown_Bundesland!$O:$O),\"\"))))))))))))","v":0},0,0,0,0,0,0,0,0,0,0,0,0,0,0,0,0,0,0,0,0,0,0,0,0,0]
[{"$error":"#N/A"},16,{"$f":"IF(Auswahl_Bundesland=\"Burgenland\",LOOKUP(B18,Dropdown_Bundesland!$F:$F,Dropdown_Bundesland!$G:$G),IF(Auswahl_Bundesland=\"Kärnten\",LOOKUP(B18,Dropdown_Bundesland!$F:$F,Dropdown_Bundesland!$H:$H),IF(AND(Auswahl_Bundesland=\"Niederösterreich\",Auswahl_Jahr>=2017),LOOKUP(B18,Dropdown_Bundesland!$F:$F,Dropdown_Bundesland!$R:$R),IF(AND(Auswahl_Bundesland=\"Niederösterreich\",Auswahl_Jahr<=2016),LOOKUP(B18,Dropdown_Bundesland!$F:$F,Dropdown_Bundesland!$I:$I),IF(Auswahl_Bundesland=\"Oberösterreich\",LOOKUP(B18,Dropdown_Bundesland!$F:$F,Dropdown_Bundesland!$J:$J),IF(Auswahl_Bundesland=\"Salzburg\",LOOKUP(B18,Dropdown_Bundesland!$F:$F,Dropdown_Bundesland!$K:$K),IF(AND(Auswahl_Bundesland=\"Steiermark\",Auswahl_Jahr>2012),LOOKUP(B18,Dropdown_Bundesland!$F:$F,Dropdown_Bundesland!$L:$L),IF(AND(Auswahl_Bundesland=\"Steiermark\",Auswahl_Jahr<2012),LOOKUP(B18,Dropdown_Bundesland!$F:$F,Dropdown_Bundesland!$P:$P),IF(AND(Auswahl_Bundesland=\"Steiermark\",Auswahl_Jahr=2012),LOOKUP(B18,Dropdown_Bundesland!$F:$F,Dropdown_Bundesland!$Q:$Q),IF(Auswahl_Bundesland=\"Tirol\",LOOKUP(B18,Dropdown_Bundesland!$F:$F,Dropdown_Bundesland!$M:$M),IF(Auswahl_Bundesland=\"Vorarlberg\",LOOKUP(B18,Dropdown_Bundesland!$F:$F,Dropdown_Bundesland!$N:$N),IF(Auswahl_Bundesland=\"Wien\",LOOKUP(B18,Dropdown_Bundesland!$F:$F,Dropdown_Bundesland!$O:$O),\"\"))))))))))))","v":0},0,0,0,0,0,0,0,0,0,0,0,0,0,0,0,0,0,0,0,0,0,0,0,0,0]
[{"$error":"#N/A"},17,{"$f":"IF(Auswahl_Bundesland=\"Burgenland\",LOOKUP(B19,Dropdown_Bundesland!$F:$F,Dropdown_Bundesland!$G:$G),IF(Auswahl_Bundesland=\"Kärnten\",LOOKUP(B19,Dropdown_Bundesland!$F:$F,Dropdown_Bundesland!$H:$H),IF(AND(Auswahl_Bundesland=\"Niederösterreich\",Auswahl_Jahr>=2017),LOOKUP(B19,Dropdown_Bundesland!$F:$F,Dropdown_Bundesland!$R:$R),IF(AND(Auswahl_Bundesland=\"Niederösterreich\",Auswahl_Jahr<=2016),LOOKUP(B19,Dropdown_Bundesland!$F:$F,Dropdown_Bundesland!$I:$I),IF(Auswahl_Bundesland=\"Oberösterreich\",LOOKUP(B19,Dropdown_Bundesland!$F:$F,Dropdown_Bundesland!$J:$J),IF(Auswahl_Bundesland=\"Salzburg\",LOOKUP(B19,Dropdown_Bundesland!$F:$F,Dropdown_Bundesland!$K:$K),IF(AND(Auswahl_Bundesland=\"Steiermark\",Auswahl_Jahr>2012),LOOKUP(B19,Dropdown_Bundesland!$F:$F,Dropdown_Bundesland!$L:$L),IF(AND(Auswahl_Bundesland=\"Steiermark\",Auswahl_Jahr<2012),LOOKUP(B19,Dropdown_Bundesland!$F:$F,Dropdown_Bundesland!$P:$P),IF(AND(Auswahl_Bundesland=\"Steiermark\",Auswahl_Jahr=2012),LOOKUP(B19,Dropdown_Bundesland!$F:$F,Dropdown_Bundesland!$Q:$Q),IF(Auswahl_Bundesland=\"Tirol\",LOOKUP(B19,Dropdown_Bundesland!$F:$F,Dropdown_Bundesland!$M:$M),IF(Auswahl_Bundesland=\"Vorarlberg\",LOOKUP(B19,Dropdown_Bundesland!$F:$F,Dropdown_Bundesland!$N:$N),IF(Auswahl_Bundesland=\"Wien\",LOOKUP(B19,Dropdown_Bundesland!$F:$F,Dropdown_Bundesland!$O:$O),\"\"))))))))))))","v":0},0,0,0,0,0,0,0,0,0,0,0,0,0,0,0,0,0,0,0,0,0,0,0,0,0]
[{"$error":"#N/A"},18,{"$f":"IF(Auswahl_Bundesland=\"Burgenland\",LOOKUP(B20,Dropdown_Bundesland!$F:$F,Dropdown_Bundesland!$G:$G),IF(Auswahl_Bundesland=\"Kärnten\",LOOKUP(B20,Dropdown_Bundesland!$F:$F,Dropdown_Bundesland!$H:$H),IF(AND(Auswahl_Bundesland=\"Niederösterreich\",Auswahl_Jahr>=2017),LOOKUP(B20,Dropdown_Bundesland!$F:$F,Dropdown_Bundesland!$R:$R),IF(AND(Auswahl_Bundesland=\"Niederösterreich\",Auswahl_Jahr<=2016),LOOKUP(B20,Dropdown_Bundesland!$F:$F,Dropdown_Bundesland!$I:$I),IF(Auswahl_Bundesland=\"Oberösterreich\",LOOKUP(B20,Dropdown_Bundesland!$F:$F,Dropdown_Bundesland!$J:$J),IF(Auswahl_Bundesland=\"Salzburg\",LOOKUP(B20,Dropdown_Bundesland!$F:$F,Dropdown_Bundesland!$K:$K),IF(AND(Auswahl_Bundesland=\"Steiermark\",Auswahl_Jahr>2012),LOOKUP(B20,Dropdown_Bundesland!$F:$F,Dropdown_Bundesland!$L:$L),IF(AND(Auswahl_Bundesland=\"Steiermark\",Auswahl_Jahr<2012),LOOKUP(B20,Dropdown_Bundesland!$F:$F,Dropdown_Bundesland!$P:$P),IF(AND(Auswahl_Bundesland=\"Steiermark\",Auswahl_Jahr=2012),LOOKUP(B20,Dropdown_Bundesland!$F:$F,Dropdown_Bundesland!$Q:$Q),IF(Auswahl_Bundesland=\"Tirol\",LOOKUP(B20,Dropdown_Bundesland!$F:$F,Dropdown_Bundesland!$M:$M),IF(Auswahl_Bundesland=\"Vorarlberg\",LOOKUP(B20,Dropdown_Bundesland!$F:$F,Dropdown_Bundesland!$N:$N),IF(Auswahl_Bundesland=\"Wien\",LOOKUP(B20,Dropdown_Bundesland!$F:$F,Dropdown_Bundesland!$O:$O),\"\"))))))))))))","v":0},0,0,0,0,0,0,0,0,0,0,0,0,0,0,0,0,0,0,0,0,0,0,0,0,0]
[{"$error":"#N/A"},19,{"$f":"IF(Auswahl_Bundesland=\"Burgenland\",LOOKUP(B21,Dropdown_Bundesland!$F:$F,Dropdown_Bundesland!$G:$G),IF(Auswahl_Bundesland=\"Kärnten\",LOOKUP(B21,Dropdown_Bundesland!$F:$F,Dropdown_Bundesland!$H:$H),IF(AND(Auswahl_Bundesland=\"Niederösterreich\",Auswahl_Jahr>=2017),LOOKUP(B21,Dropdown_Bundesland!$F:$F,Dropdown_Bundesland!$R:$R),IF(AND(Auswahl_Bundesland=\"Niederösterreich\",Auswahl_Jahr<=2016),LOOKUP(B21,Dropdown_Bundesland!$F:$F,Dropdown_Bundesland!$I:$I),IF(Auswahl_Bundesland=\"Oberösterreich\",LOOKUP(B21,Dropdown_Bundesland!$F:$F,Dropdown_Bundesland!$J:$J),IF(Auswahl_Bundesland=\"Salzburg\",LOOKUP(B21,Dropdown_Bundesland!$F:$F,Dropdown_Bundesland!$K:$K),IF(AND(Auswahl_Bundesland=\"Steiermark\",Auswahl_Jahr>2012),LOOKUP(B21,Dropdown_Bundesland!$F:$F,Dropdown_Bundesland!$L:$L),IF(AND(Auswahl_Bundesland=\"Steiermark\",Auswahl_Jahr<2012),LOOKUP(B21,Dropdown_Bundesland!$F:$F,Dropdown_Bundesland!$P:$P),IF(AND(Auswahl_Bundesland=\"Steiermark\",Auswahl_Jahr=2012),LOOKUP(B21,Dropdown_Bundesland!$F:$F,Dropdown_Bundesland!$Q:$Q),IF(Auswahl_Bundesland=\"Tirol\",LOOKUP(B21,Dropdown_Bundesland!$F:$F,Dropdown_Bundesland!$M:$M),IF(Auswahl_Bundesland=\"Vorarlberg\",LOOKUP(B21,Dropdown_Bundesland!$F:$F,Dropdown_Bundesland!$N:$N),IF(Auswahl_Bundesland=\"Wien\",LOOKUP(B21,Dropdown_Bundesland!$F:$F,Dropdown_Bundesland!$O:$O),\"\"))))))))))))","v":0},0,0,0,0,0,0,0,0,0,0,0,0,0,0,0,0,0,0,0,0,0,0,0,0,0]
[{"$error":"#N/A"},20,{"$f":"IF(Auswahl_Bundesland=\"Burgenland\",LOOKUP(B22,Dropdown_Bundesland!$F:$F,Dropdown_Bundesland!$G:$G),IF(Auswahl_Bundesland=\"Kärnten\",LOOKUP(B22,Dropdown_Bundesland!$F:$F,Dropdown_Bundesland!$H:$H),IF(AND(Auswahl_Bundesland=\"Niederösterreich\",Auswahl_Jahr>=2017),LOOKUP(B22,Dropdown_Bundesland!$F:$F,Dropdown_Bundesland!$R:$R),IF(AND(Auswahl_Bundesland=\"Niederösterreich\",Auswahl_Jahr<=2016),LOOKUP(B22,Dropdown_Bundesland!$F:$F,Dropdown_Bundesland!$I:$I),IF(Auswahl_Bundesland=\"Oberösterreich\",LOOKUP(B22,Dropdown_Bundesland!$F:$F,Dropdown_Bundesland!$J:$J),IF(Auswahl_Bundesland=\"Salzburg\",LOOKUP(B22,Dropdown_Bundesland!$F:$F,Dropdown_Bundesland!$K:$K),IF(AND(Auswahl_Bundesland=\"Steiermark\",Auswahl_Jahr>2012),LOOKUP(B22,Dropdown_Bundesland!$F:$F,Dropdown_Bundesland!$L:$L),IF(AND(Auswahl_Bundesland=\"Steiermark\",Auswahl_Jahr<2012),LOOKUP(B22,Dropdown_Bundesland!$F:$F,Dropdown_Bundesland!$P:$P),IF(AND(Auswahl_Bundesland=\"Steiermark\",Auswahl_Jahr=2012),LOOKUP(B22,Dropdown_Bundesland!$F:$F,Dropdown_Bundesland!$Q:$Q),IF(Auswahl_Bundesland=\"Tirol\",LOOKUP(B22,Dropdown_Bundesland!$F:$F,Dropdown_Bundesland!$M:$M),IF(Auswahl_Bundesland=\"Vorarlberg\",LOOKUP(B22,Dropdown_Bundesland!$F:$F,Dropdown_Bundesland!$N:$N),IF(Auswahl_Bundesland=\"Wien\",LOOKUP(B22,Dropdown_Bundesland!$F:$F,Dropdown_Bundesland!$O:$O),\"\"))))))))))))","v":0},0,0,0,0,0,0,0,0,0,0,0,0,0,0,0,0,0,0,0,0,0,0,0,0,0]
[{"$error":"#N/A"},21,{"$f":"IF(Auswahl_Bundesland=\"Burgenland\",LOOKUP(B23,Dropdown_Bundesland!$F:$F,Dropdown_Bundesland!$G:$G),IF(Auswahl_Bundesland=\"Kärnten\",LOOKUP(B23,Dropdown_Bundesland!$F:$F,Dropdown_Bundesland!$H:$H),IF(AND(Auswahl_Bundesland=\"Niederösterreich\",Auswahl_Jahr>=2017),LOOKUP(B23,Dropdown_Bundesland!$F:$F,Dropdown_Bundesland!$R:$R),IF(AND(Auswahl_Bundesland=\"Niederösterreich\",Auswahl_Jahr<=2016),LOOKUP(B23,Dropdown_Bundesland!$F:$F,Dropdown_Bundesland!$I:$I),IF(Auswahl_Bundesland=\"Oberösterreich\",LOOKUP(B23,Dropdown_Bundesland!$F:$F,Dropdown_Bundesland!$J:$J),IF(Auswahl_Bundesland=\"Salzburg\",LOOKUP(B23,Dropdown_Bundesland!$F:$F,Dropdown_Bundesland!$K:$K),IF(AND(Auswahl_Bundesland=\"Steiermark\",Auswahl_Jahr>2012),LOOKUP(B23,Dropdown_Bundesland!$F:$F,Dropdown_Bundesland!$L:$L),IF(AND(Auswahl_Bundesland=\"Steiermark\",Auswahl_Jahr<2012),LOOKUP(B23,Dropdown_Bundesland!$F:$F,Dropdown_Bundesland!$P:$P),IF(AND(Auswahl_Bundesland=\"Steiermark\",Auswahl_Jahr=2012),LOOKUP(B23,Dropdown_Bundesland!$F:$F,Dropdown_Bundesland!$Q:$Q),IF(Auswahl_Bundesland=\"Tirol\",LOOKUP(B23,Dropdown_Bundesland!$F:$F,Dropdown_Bundesland!$M:$M),IF(Auswahl_Bundesland=\"Vorarlberg\",LOOKUP(B23,Dropdown_Bundesland!$F:$F,Dropdown_Bundesland!$N:$N),IF(Auswahl_Bundesland=\"Wien\",LOOKUP(B23,Dropdown_Bundesland!$F:$F,Dropdown_Bundesland!$O:$O),\"\"))))))))))))","v":0},0,0,0,0,0,0,0,0,0,0,0,0,0,0,0,0,0,0,0,0,0,0,0,0,0]
[{"$error":"#N/A"},22,{"$f":"IF(Auswahl_Bundesland=\"Burgenland\",LOOKUP(B24,Dropdown_Bundesland!$F:$F,Dropdown_Bundesland!$G:$G),IF(Auswahl_Bundesland=\"Kärnten\",LOOKUP(B24,Dropdown_Bundesland!$F:$F,Dropdown_Bundesland!$H:$H),IF(AND(Auswahl_Bundesland=\"Niederösterreich\",Auswahl_Jahr>=2017),LOOKUP(B24,Dropdown_Bundesland!$F:$F,Dropdown_Bundesland!$R:$R),IF(AND(Auswahl_Bundesland=\"Niederösterreich\",Auswahl_Jahr<=2016),LOOKUP(B24,Dropdown_Bundesland!$F:$F,Dropdown_Bundesland!$I:$I),IF(Auswahl_Bundesland=\"Oberösterreich\",LOOKUP(B24,Dropdown_Bundesland!$F:$F,Dropdown_Bundesland!$J:$J),IF(Auswahl_Bundesland=\"Salzburg\",LOOKUP(B24,Dropdown_Bundesland!$F:$F,Dropdown_Bundesland!$K:$K),IF(AND(Auswahl_Bundesland=\"Steiermark\",Auswahl_Jahr>2012),LOOKUP(B24,Dropdown_Bundesland!$F:$F,Dropdown_Bundesland!$L:$L),IF(AND(Auswahl_Bundesland=\"Steiermark\",Auswahl_Jahr<2012),LOOKUP(B24,Dropdown_Bundesland!$F:$F,Dropdown_Bundesland!$P:$P),IF(AND(Auswahl_Bundesland=\"Steiermark\",Auswahl_Jahr=2012),LOOKUP(B24,Dropdown_Bundesland!$F:$F,Dropdown_Bundesland!$Q:$Q),IF(Auswahl_Bundesland=\"Tirol\",LOOKUP(B24,Dropdown_Bundesland!$F:$F,Dropdown_Bundesland!$M:$M),IF(Auswahl_Bundesland=\"Vorarlberg\",LOOKUP(B24,Dropdown_Bundesland!$F:$F,Dropdown_Bundesland!$N:$N),IF(Auswahl_Bundesland=\"Wien\",LOOKUP(B24,Dropdown_Bundesland!$F:$F,Dropdown_Bundesland!$O:$O),\"\"))))))))))))","v":0},0,0,0,0,0,0,0,0,0,0,0,0,0,0,0,0,0,0,0,0,0,0,0,0,0]
[{"$error":"#N/A"},23,{"$f":"IF(Auswahl_Bundesland=\"Burgenland\",LOOKUP(B25,Dropdown_Bundesland!$F:$F,Dropdown_Bundesland!$G:$G),IF(Auswahl_Bundesland=\"Kärnten\",LOOKUP(B25,Dropdown_Bundesland!$F:$F,Dropdown_Bundesland!$H:$H),IF(AND(Auswahl_Bundesland=\"Niederösterreich\",Auswahl_Jahr>=2017),LOOKUP(B25,Dropdown_Bundesland!$F:$F,Dropdown_Bundesland!$R:$R),IF(AND(Auswahl_Bundesland=\"Niederösterreich\",Auswahl_Jahr<=2016),LOOKUP(B25,Dropdown_Bundesland!$F:$F,Dropdown_Bundesland!$I:$I),IF(Auswahl_Bundesland=\"Oberösterreich\",LOOKUP(B25,Dropdown_Bundesland!$F:$F,Dropdown_Bundesland!$J:$J),IF(Auswahl_Bundesland=\"Salzburg\",LOOKUP(B25,Dropdown_Bundesland!$F:$F,Dropdown_Bundesland!$K:$K),IF(AND(Auswahl_Bundesland=\"Steiermark\",Auswahl_Jahr>2012),LOOKUP(B25,Dropdown_Bundesland!$F:$F,Dropdown_Bundesland!$L:$L),IF(AND(Auswahl_Bundesland=\"Steiermark\",Auswahl_Jahr<2012),LOOKUP(B25,Dropdown_Bundesland!$F:$F,Dropdown_Bundesland!$P:$P),IF(AND(Auswahl_Bundesland=\"Steiermark\",Auswahl_Jahr=2012),LOOKUP(B25,Dropdown_Bundesland!$F:$F,Dropdown_Bundesland!$Q:$Q),IF(Auswahl_Bundesland=\"Tirol\",LOOKUP(B25,Dropdown_Bundesland!$F:$F,Dropdown_Bundesland!$M:$M),IF(Auswahl_Bundesland=\"Vorarlberg\",LOOKUP(B25,Dropdown_Bundesland!$F:$F,Dropdown_Bundesland!$N:$N),IF(Auswahl_Bundesland=\"Wien\",LOOKUP(B25,Dropdown_Bundesland!$F:$F,Dropdown_Bundesland!$O:$O),\"\"))))))))))))","v":0},0,0,0,0,0,0,0,0,0,0,0,0,0,0,0,0,0,0,0,0,0,0,0,0,0]
[{"$error":"#N/A"},24,{"$f":"IF(Auswahl_Bundesland=\"Burgenland\",LOOKUP(B26,Dropdown_Bundesland!$F:$F,Dropdown_Bundesland!$G:$G),IF(Auswahl_Bundesland=\"Kärnten\",LOOKUP(B26,Dropdown_Bundesland!$F:$F,Dropdown_Bundesland!$H:$H),IF(AND(Auswahl_Bundesland=\"Niederösterreich\",Auswahl_Jahr>=2017),LOOKUP(B26,Dropdown_Bundesland!$F:$F,Dropdown_Bundesland!$R:$R),IF(AND(Auswahl_Bundesland=\"Niederösterreich\",Auswahl_Jahr<=2016),LOOKUP(B26,Dropdown_Bundesland!$F:$F,Dropdown_Bundesland!$I:$I),IF(Auswahl_Bundesland=\"Oberösterreich\",LOOKUP(B26,Dropdown_Bundesland!$F:$F,Dropdown_Bundesland!$J:$J),IF(Auswahl_Bundesland=\"Salzburg\",LOOKUP(B26,Dropdown_Bundesland!$F:$F,Dropdown_Bundesland!$K:$K),IF(AND(Auswahl_Bundesland=\"Steiermark\",Auswahl_Jahr>2012),LOOKUP(B26,Dropdown_Bundesland!$F:$F,Dropdown_Bundesland!$L:$L),IF(AND(Auswahl_Bundesland=\"Steiermark\",Auswahl_Jahr<2012),LOOKUP(B26,Dropdown_Bundesland!$F:$F,Dropdown_Bundesland!$P:$P),IF(AND(Auswahl_Bundesland=\"Steiermark\",Auswahl_Jahr=2012),LOOKUP(B26,Dropdown_Bundesland!$F:$F,Dropdown_Bundesland!$Q:$Q),IF(Auswahl_Bundesland=\"Tirol\",LOOKUP(B26,Dropdown_Bundesland!$F:$F,Dropdown_Bundesland!$M:$M),IF(Auswahl_Bundesland=\"Vorarlberg\",LOOKUP(B26,Dropdown_Bundesland!$F:$F,Dropdown_Bundesland!$N:$N),IF(Auswahl_Bundesland=\"Wien\",LOOKUP(B26,Dropdown_Bundesland!$F:$F,Dropdown_Bundesland!$O:$O),\"\"))))))))))))","v":0},0,0,0,0,0,0,0,0,0,0,0,0,0,0,0,0,0,0,0,0,0,0,0,0,0]
[]
[]
[null,null,null,{"$f":"Auswahl_Jahr","v":2025},{"$f":"Auswahl_Jahr-1","v":2024},"Anteil","Veraend_abs","Veraend_Proz","X","Y",null,null,{"$f":"\"Verae_absolut_\"&Auswahl_Bezirk","v":"Verae_absolut_Oberpullendorf"},{"$f":"\"Verae_Proz_\"&Auswahl_Bezirk","v":"Verae_Proz_Oberpullendorf"},null,"Max_Veraend_abs","Max_Veraend_Proz"]
[{"$f":"VLOOKUP(Status&Auswahl_Bundesland&C30,matrix_olap_bm,2,FALSE)","v":4},1,{"$f":"IF(Auswahl_Bundesland=\"Burgenland\",LOOKUP(B30,Dropdown_Bundesland!$F:$F,Dropdown_Bundesland!$G:$G),IF(Auswahl_Bundesland=\"Kärnten\",LOOKUP(B30,Dropdown_Bundesland!$F:$F,Dropdown_Bundesland!$H:$H),IF(AND(Auswahl_Bundesland=\"Niederösterreich\",Auswahl_Jahr<=2016),LOOKUP(B30,Dropdown_Bundesland!$F:$F,Dropdown_Bundesland!$I:$I),IF(AND(Auswahl_Bundesland=\"Niederösterreich\",Auswahl_Jahr>=2017),LOOKUP(B30,Dropdown_Bundesland!$F:$F,Dropdown_Bundesland!$R:$R),IF(Auswahl_Bundesland=\"Oberösterreich\",LOOKUP(B30,Dropdown_Bundesland!$F:$F,Dropdown_Bundesland!$J:$J),IF(Auswahl_Bundesland=\"Salzburg\",LOOKUP(B30,Dropdown_Bundesland!$F:$F,Dropdown_Bundesland!$K:$K),IF(AND(Auswahl_Bundesland=\"Steiermark\",Auswahl_Jahr>2012),LOOKUP(B30,Dropdown_Bundesland!$F:$F,Dropdown_Bundesland!$L:$L),IF(AND(Auswahl_Bundesland=\"Steiermark\",Auswahl_Jahr<2012),LOOKUP(B30,Dropdown_Bundesland!$F:$F,Dropdown_Bundesland!$P:$P),IF(AND(Auswahl_Bundesland=\"Steiermark\",Auswahl_Jahr=2012),LOOKUP(B30,Dropdown_Bundesland!$F:$F,Dropdown_Bundesland!$Q:$Q),IF(Auswahl_Bundesland=\"Tirol\",LOOKUP(B30,Dropdown_Bundesland!$F:$F,Dropdown_Bundesland!$M:$M),IF(Auswahl_Bundesland=\"Vorarlberg\",LOOKUP(B30,Dropdown_Bundesland!$F:$F,Dropdown_Bundesland!$N:$N),IF(Auswahl_Bundesland=\"Wien\",LOOKUP(B30,Dropdown_Bundesland!$F:$F,Dropdown_Bundesland!$O:$O),\"\"))))))))))))","v":"Eisenstadt-Umgebung"},{"$f":"LOOKUP($D$29,$2:$2,3:3)","v":4713},{"$f":"LOOKUP($E$29,$2:$2,3:3)","v":4618},{"$f":"D30*100/$D$54","v":21.07027896995708},{"$f":"IF(Auswahl_Jahr<2002,0,IF(D30=0,0,D30-E30))","v":95},{"$f":"IF(Auswahl_Jahr<2002,0,IF(D30=0,0,(D30*100/E30)-100))","v":2.057167605023821},{"$f":"VLOOKUP($C30,Matrix_X_Y,2,FALSE)","v":3.8},{"$f":"VLOOKUP($C30,Matrix_X_Y,3,FALSE)","v":21500},{"$f":"C30","v":"Eisenstadt-Umgebung"},{"$f":"F30","v":21.07027896995708},{"$f":"IF($C30=Auswahl_Bezirk,G30,\" \")","v":" "},{"$f":"IF(AND(Auswahl_Jahr<>2001,$C30=Auswahl_Bezirk),H30,NA())","v":{"$error":"#N/A"}},{"$f":"IF(M30<>0,M30,NA())","v":" "},{"$f":"IF(AND(MAX(G30:G53)>MIN(G30:G53)*-1,MIN(G30:G53)<0),MAX(G30:G53),IF(AND(MAX(G30:G53)<MIN(G30:G53)*-1,MAX(G30:G53)>0),MIN(G30:G53),0))","v":95},{"$f":"IF(AND(MAX(H30:H53)>MIN(H30:H53)*-1,MIN(H30:H53)<0),MAX(H30:H53),IF(AND(MAX(H30:H53)<MIN(H30:H53)*-1,MAX(H30:H53)>0),MIN(H30:H53),0))","v":3.4546805349182819}]
[5,2,{"$f":"IF(Auswahl_Bundesland=\"Burgenland\",LOOKUP(B31,Dropdown_Bundesland!$F:$F,Dropdown_Bundesland!$G:$G),IF(Auswahl_Bundesland=\"Kärnten\",LOOKUP(B31,Dropdown_Bundesland!$F:$F,Dropdown_Bundesland!$H:$H),IF(AND(Auswahl_Bundesland=\"Niederösterreich\",Auswahl_Jahr<=2016),LOOKUP(B31,Dropdown_Bundesland!$F:$F,Dropdown_Bundesland!$I:$I),IF(AND(Auswahl_Bundesland=\"Niederösterreich\",Auswahl_Jahr>=2017),LOOKUP(B31,Dropdown_Bundesland!$F:$F,Dropdown_Bundesland!$R:$R),IF(Auswahl_Bundesland=\"Oberösterreich\",LOOKUP(B31,Dropdown_Bundesland!$F:$F,Dropdown_Bundesland!$J:$J),IF(Auswahl_Bundesland=\"Salzburg\",LOOKUP(B31,Dropdown_Bundesland!$F:$F,Dropdown_Bundesland!$K:$K),IF(AND(Auswahl_Bundesland=\"Steiermark\",Auswahl_Jahr>2012),LOOKUP(B31,Dropdown_Bundesland!$F:$F,Dropdown_Bundesland!$L:$L),IF(AND(Auswahl_Bundesland=\"Steiermark\",Auswahl_Jahr<2012),LOOKUP(B31,Dropdown_Bundesland!$F:$F,Dropdown_Bundesland!$P:$P),IF(AND(Auswahl_Bundesland=\"Steiermark\",Auswahl_Jahr=2012),LOOKUP(B31,Dropdown_Bundesland!$F:$F,Dropdown_Bundesland!$Q:$Q),IF(Auswahl_Bundesland=\"Tirol\",LOOKUP(B31,Dropdown_Bundesland!$F:$F,Dropdown_Bundesland!$M:$M),IF(Auswahl_Bundesland=\"Vorarlberg\",LOOKUP(B31,Dropdown_Bundesland!$F:$F,Dropdown_Bundesland!$N:$N),IF(Auswahl_Bundesland=\"Wien\",LOOKUP(B31,Dropdown_Bundesland!$F:$F,Dropdown_Bundesland!$O:$O),\"\"))))))))))))","v":"Neusiedl am See"},{"$f":"LOOKUP($D$29,$2:$2,4:4)","v":4718},{"$f":"LOOKUP($E$29,$2:$2,4:4)","v":4685},{"$f":"D31*100/$D$54","v":21.092632331902717},33,0.70437566702241838,4.5,23000,{"$f":"C31","v":"Neusiedl am See"},{"$f":"F31","v":21.092632331902717}," ",{"$error":"#N/A"},{"$f":"IF(M31<>0,M31,NA())","v":" "},"Min_Veraend_abs","Min_Veraend_Proz"]
[6,3,{"$f":"IF(Auswahl_Bundesland=\"Burgenland\",LOOKUP(B32,Dropdown_Bundesland!$F:$F,Dropdown_Bundesland!$G:$G),IF(Auswahl_Bundesland=\"Kärnten\",LOOKUP(B32,Dropdown_Bundesland!$F:$F,Dropdown_Bundesland!$H:$H),IF(AND(Auswahl_Bundesland=\"Niederösterreich\",Auswahl_Jahr<=2016),LOOKUP(B32,Dropdown_Bundesland!$F:$F,Dropdown_Bundesland!$I:$I),IF(AND(Auswahl_Bundesland=\"Niederösterreich\",Auswahl_Jahr>=2017),LOOKUP(B32,Dropdown_Bundesland!$F:$F,Dropdown_Bundesland!$R:$R),IF(Auswahl_Bundesland=\"Oberösterreich\",LOOKUP(B32,Dropdown_Bundesland!$F:$F,Dropdown_Bundesland!$J:$J),IF(Auswahl_Bundesland=\"Salzburg\",LOOKUP(B32,Dropdown_Bundesland!$F:$F,Dropdown_Bundesland!$K:$K),IF(AND(Auswahl_Bundesland=\"Steiermark\",Auswahl_Jahr>2012),LOOKUP(B32,Dropdown_Bundesland!$F:$F,Dropdown_Bundesland!$L:$L),IF(AND(Auswahl_Bundesland=\"Steiermark\",Auswahl_Jahr<2012),LOOKUP(B32,Dropdown_Bundesland!$F:$F,Dropdown_Bundesland!$P:$P),IF(AND(Auswahl_Bundesland=\"Steiermark\",Auswahl_Jahr=2012),LOOKUP(B32,Dropdown_Bundesland!$F:$F,Dropdown_Bundesland!$Q:$Q),IF(Auswahl_Bundesland=\"Tirol\",LOOKUP(B32,Dropdown_Bundesland!$F:$F,Dropdown_Bundesland!$M:$M),IF(Auswahl_Bundesland=\"Vorarlberg\",LOOKUP(B32,Dropdown_Bundesland!$F:$F,Dropdown_Bundesland!$N:$N),IF(Auswahl_Bundesland=\"Wien\",LOOKUP(B32,Dropdown_Bundesland!$F:$F,Dropdown_Bundesland!$O:$O),\"\"))))))))))))","v":"Mattersburg"},2751,2662,12.29881974248927,89,3.3433508640120237,3.3,19300,"Mattersburg",12.29881974248927," ",{"$error":"#N/A"}," ",{"$f":"P30*-1","v":-95},{"$f":"Q30*-1","v":-3.4546805349182819}]
[7,4,{"$f":"IF(Auswahl_Bundesland=\"Burgenland\",LOOKUP(B33,Dropdown_Bundesland!$F:$F,Dropdown_Bundesland!$G:$G),IF(Auswahl_Bundesland=\"Kärnten\",LOOKUP(B33,Dropdown_Bundesland!$F:$F,Dropdown_Bundesland!$H:$H),IF(AND(Auswahl_Bundesland=\"Niederösterreich\",Auswahl_Jahr<=2016),LOOKUP(B33,Dropdown_Bundesland!$F:$F,Dropdown_Bundesland!$I:$I),IF(AND(Auswahl_Bundesland=\"Niederösterreich\",Auswahl_Jahr>=2017),LOOKUP(B33,Dropdown_Bundesland!$F:$F,Dropdown_Bundesland!$R:$R),IF(Auswahl_Bundesland=\"Oberösterreich\",LOOKUP(B33,Dropdown_Bundesland!$F:$F,Dropdown_Bundesland!$J:$J),IF(Auswahl_Bundesland=\"Salzburg\",LOOKUP(B33,Dropdown_Bundesland!$F:$F,Dropdown_Bundesland!$K:$K),IF(AND(Auswahl_Bundesland=\"Steiermark\",Auswahl_Jahr>2012),LOOKUP(B33,Dropdown_Bundesland!$F:$F,Dropdown_Bundesland!$L:$L),IF(AND(Auswahl_Bundesland=\"Steiermark\",Auswahl_Jahr<2012),LOOKUP(B33,Dropdown_Bundesland!$F:$F,Dropdown_Bundesland!$P:$P),IF(AND(Auswahl_Bundesland=\"Steiermark\",Auswahl_Jahr=2012),LOOKUP(B33,Dropdown_Bundesland!$F:$F,Dropdown_Bundesland!$Q:$Q),IF(Auswahl_Bundesland=\"Tirol\",LOOKUP(B33,Dropdown_Bundesland!$F:$F,Dropdown_Bundesland!$M:$M),IF(Auswahl_Bundesland=\"Vorarlberg\",LOOKUP(B33,Dropdown_Bundesland!$F:$F,Dropdown_Bundesland!$N:$N),IF(Auswahl_Bundesland=\"Wien\",LOOKUP(B33,Dropdown_Bundesland!$F:$F,Dropdown_Bundesland!$O:$O),\"\"))))))))))))","v":"Oberpullendorf"},2785,2692,12.450822603719599,93,3.4546805349182819,3.55,15000,"Oberpullendorf",12.450822603719599,93,3.4546805349182819,93]
[8,5,{"$f":"IF(Auswahl_Bundesland=\"Burgenland\",LOOKUP(B34,Dropdown_Bundesland!$F:$F,Dropdown_Bundesland!$G:$G),IF(Auswahl_Bundesland=\"Kärnten\",LOOKUP(B34,Dropdown_Bundesland!$F:$F,Dropdown_Bundesland!$H:$H),IF(AND(Auswahl_Bundesland=\"Niederösterreich\",Auswahl_Jahr<=2016),LOOKUP(B34,Dropdown_Bundesland!$F:$F,Dropdown_Bundesland!$I:$I),IF(AND(Auswahl_Bundesland=\"Niederösterreich\",Auswahl_Jahr>=2017),LOOKUP(B34,Dropdown_Bundesland!$F:$F,Dropdown_Bundesland!$R:$R),IF(Auswahl_Bundesland=\"Oberösterreich\",LOOKUP(B34,Dropdown_Bundesland!$F:$F,Dropdown_Bundesland!$J:$J),IF(Auswahl_Bundesland=\"Salzburg\",LOOKUP(B34,Dropdown_Bundesland!$F:$F,Dropdown_Bundesland!$K:$K),IF(AND(Auswahl_Bundesland=\"Steiermark\",Auswahl_Jahr>2012),LOOKUP(B34,Dropdown_Bundesland!$F:$F,Dropdown_Bundesland!$L:$L),IF(AND(Auswahl_Bundesland=\"Steiermark\",Auswahl_Jahr<2012),LOOKUP(B34,Dropdown_Bundesland!$F:$F,Dropdown_Bundesland!$P:$P),IF(AND(Auswahl_Bundesland=\"Steiermark\",Auswahl_Jahr=2012),LOOKUP(B34,Dropdown_Bundesland!$F:$F,Dropdown_Bundesland!$Q:$Q),IF(Auswahl_Bundesland=\"Tirol\",LOOKUP(B34,Dropdown_Bundesland!$F:$F,Dropdown_Bundesland!$M:$M),IF(Auswahl_Bundesland=\"Vorarlberg\",LOOKUP(B34,Dropdown_Bundesland!$F:$F,Dropdown_Bundesland!$N:$N),IF(Auswahl_Bundesland=\"Wien\",LOOKUP(B34,Dropdown_Bundesland!$F:$F,Dropdown_Bundesland!$O:$O),\"\"))))))))))))","v":"Oberwart"},3942,3994,17.623390557939913,-52,-1.3019529293940906,3,10500,"Oberwart",17.623390557939913," ",{"$error":"#N/A"}," "]
[9,6,{"$f":"IF(Auswahl_Bundesland=\"Burgenland\",LOOKUP(B35,Dropdown_Bundesland!$F:$F,Dropdown_Bundesland!$G:$G),IF(Auswahl_Bundesland=\"Kärnten\",LOOKUP(B35,Dropdown_Bundesland!$F:$F,Dropdown_Bundesland!$H:$H),IF(AND(Auswahl_Bundesland=\"Niederösterreich\",Auswahl_Jahr<=2016),LOOKUP(B35,Dropdown_Bundesland!$F:$F,Dropdown_Bundesland!$I:$I),IF(AND(Auswahl_Bundesland=\"Niederösterreich\",Auswahl_Jahr>=2017),LOOKUP(B35,Dropdown_Bundesland!$F:$F,Dropdown_Bundesland!$R:$R),IF(Auswahl_Bundesland=\"Oberösterreich\",LOOKUP(B35,Dropdown_Bundesland!$F:$F,Dropdown_Bundesland!$J:$J),IF(Auswahl_Bundesland=\"Salzburg\",LOOKUP(B35,Dropdown_Bundesland!$F:$F,Dropdown_Bundesland!$K:$K),IF(AND(Auswahl_Bundesland=\"Steiermark\",Auswahl_Jahr>2012),LOOKUP(B35,Dropdown_Bundesland!$F:$F,Dropdown_Bundesland!$L:$L),IF(AND(Auswahl_Bundesland=\"Steiermark\",Auswahl_Jahr<2012),LOOKUP(B35,Dropdown_Bundesland!$F:$F,Dropdown_Bundesland!$P:$P),IF(AND(Auswahl_Bundesland=\"Steiermark\",Auswahl_Jahr=2012),LOOKUP(B35,Dropdown_Bundesland!$F:$F,Dropdown_Bundesland!$Q:$Q),IF(Auswahl_Bundesland=\"Tirol\",LOOKUP(B35,Dropdown_Bundesland!$F:$F,Dropdown_Bundesland!$M:$M),IF(Auswahl_Bundesland=\"Vorarlberg\",LOOKUP(B35,Dropdown_Bundesland!$F:$F,Dropdown_Bundesland!$N:$N),IF(Auswahl_Bundesland=\"Wien\",LOOKUP(B35,Dropdown_Bundesland!$F:$F,Dropdown_Bundesland!$O:$O),\"\"))))))))))))","v":"Güssing"},1796,1777,8.0293276108726754,19,1.0692177827799725,3.1,5900,"Güssing",8.0293276108726754," ",{"$error":"#N/A"}," "]
[10,7,{"$f":"IF(Auswahl_Bundesland=\"Burgenland\",LOOKUP(B36,Dropdown_Bundesland!$F:$F,Dropdown_Bundesland!$G:$G),IF(Auswahl_Bundesland=\"Kärnten\",LOOKUP(B36,Dropdown_Bundesland!$F:$F,Dropdown_Bundesland!$H:$H),IF(AND(Auswahl_Bundesland=\"Niederösterreich\",Auswahl_Jahr<=2016),LOOKUP(B36,Dropdown_Bundesland!$F:$F,Dropdown_Bundesland!$I:$I),IF(AND(Auswahl_Bundesland=\"Niederösterreich\",Auswahl_Jahr>=2017),LOOKUP(B36,Dropdown_Bundesland!$F:$F,Dropdown_Bundesland!$R:$R),IF(Auswahl_Bundesland=\"Oberösterreich\",LOOKUP(B36,Dropdown_Bundesland!$F:$F,Dropdown_Bundesland!$J:$J),IF(Auswahl_Bundesland=\"Salzburg\",LOOKUP(B36,Dropdown_Bundesland!$F:$F,Dropdown_Bundesland!$K:$K),IF(AND(Auswahl_Bundesland=\"Steiermark\",Auswahl_Jahr>2012),LOOKUP(B36,Dropdown_Bundesland!$F:$F,Dropdown_Bundesland!$L:$L),IF(AND(Auswahl_Bundesland=\"Steiermark\",Auswahl_Jahr<2012),LOOKUP(B36,Dropdown_Bundesland!$F:$F,Dropdown_Bundesland!$P:$P),IF(AND(Auswahl_Bundesland=\"Steiermark\",Auswahl_Jahr=2012),LOOKUP(B36,Dropdown_Bundesland!$F:$F,Dropdown_Bundesland!$Q:$Q),IF(Auswahl_Bundesland=\"Tirol\",LOOKUP(B36,Dropdown_Bundesland!$F:$F,Dropdown_Bundesland!$M:$M),IF(Auswahl_Bundesland=\"Vorarlberg\",LOOKUP(B36,Dropdown_Bundesland!$F:$F,Dropdown_Bundesland!$N:$N),IF(Auswahl_Bundesland=\"Wien\",LOOKUP(B36,Dropdown_Bundesland!$F:$F,Dropdown_Bundesland!$O:$O),\"\"))))))))))))","v":"Jennersdorf"},1663,1609,7.4347281831187413,54,3.3561218147917913,2.82,2500,"Jennersdorf",7.4347281831187413," ",{"$error":"#N/A"}," "]
[{"$error":"#N/A"},8,{"$f":"IF(Auswahl_Bundesland=\"Burgenland\",LOOKUP(B37,Dropdown_Bundesland!$F:$F,Dropdown_Bundesland!$G:$G),IF(Auswahl_Bundesland=\"Kärnten\",LOOKUP(B37,Dropdown_Bundesland!$F:$F,Dropdown_Bundesland!$H:$H),IF(AND(Auswahl_Bundesland=\"Niederösterreich\",Auswahl_Jahr<=2016),LOOKUP(B37,Dropdown_Bundesland!$F:$F,Dropdown_Bundesland!$I:$I),IF(AND(Auswahl_Bundesland=\"Niederösterreich\",Auswahl_Jahr>=2017),LOOKUP(B37,Dropdown_Bundesland!$F:$F,Dropdown_Bundesland!$R:$R),IF(Auswahl_Bundesland=\"Oberösterreich\",LOOKUP(B37,Dropdown_Bundesland!$F:$F,Dropdown_Bundesland!$J:$J),IF(Auswahl_Bundesland=\"Salzburg\",LOOKUP(B37,Dropdown_Bundesland!$F:$F,Dropdown_Bundesland!$K:$K),IF(AND(Auswahl_Bundesland=\"Steiermark\",Auswahl_Jahr>2012),LOOKUP(B37,Dropdown_Bundesland!$F:$F,Dropdown_Bundesland!$L:$L),IF(AND(Auswahl_Bundesland=\"Steiermark\",Auswahl_Jahr<2012),LOOKUP(B37,Dropdown_Bundesland!$F:$F,Dropdown_Bundesland!$P:$P),IF(AND(Auswahl_Bundesland=\"Steiermark\",Auswahl_Jahr=2012),LOOKUP(B37,Dropdown_Bundesland!$F:$F,Dropdown_Bundesland!$Q:$Q),IF(Auswahl_Bundesland=\"Tirol\",LOOKUP(B37,Dropdown_Bundesland!$F:$F,Dropdown_Bundesland!$M:$M),IF(Auswahl_Bundesland=\"Vorarlberg\",LOOKUP(B37,Dropdown_Bundesland!$F:$F,Dropdown_Bundesland!$N:$N),IF(Auswahl_Bundesland=\"Wien\",LOOKUP(B37,Dropdown_Bundesland!$F:$F,Dropdown_Bundesland!$O:$O),\"\"))))))))))))","v":0},0,0,0,0,0,{"$error":"#N/A"},{"$error":"#N/A"},0,{"$f":"F37","v":0}," ",{"$error":"#N/A"}," "]
[{"$error":"#N/A"},9,{"$f":"IF(Auswahl_Bundesland=\"Burgenland\",LOOKUP(B38,Dropdown_Bundesland!$F:$F,Dropdown_Bundesland!$G:$G),IF(Auswahl_Bundesland=\"Kärnten\",LOOKUP(B38,Dropdown_Bundesland!$F:$F,Dropdown_Bundesland!$H:$H),IF(AND(Auswahl_Bundesland=\"Niederösterreich\",Auswahl_Jahr<=2016),LOOKUP(B38,Dropdown_Bundesland!$F:$F,Dropdown_Bundesland!$I:$I),IF(AND(Auswahl_Bundesland=\"Niederösterreich\",Auswahl_Jahr>=2017),LOOKUP(B38,Dropdown_Bundesland!$F:$F,Dropdown_Bundesland!$R:$R),IF(Auswahl_Bundesland=\"Oberösterreich\",LOOKUP(B38,Dropdown_Bundesland!$F:$F,Dropdown_Bundesland!$J:$J),IF(Auswahl_Bundesland=\"Salzburg\",LOOKUP(B38,Dropdown_Bundesland!$F:$F,Dropdown_Bundesland!$K:$K),IF(AND(Auswahl_Bundesland=\"Steiermark\",Auswahl_Jahr>2012),LOOKUP(B38,Dropdown_Bundesland!$F:$F,Dropdown_Bundesland!$L:$L),IF(AND(Auswahl_Bundesland=\"Steiermark\",Auswahl_Jahr<2012),LOOKUP(B38,Dropdown_Bundesland!$F:$F,Dropdown_Bundesland!$P:$P),IF(AND(Auswahl_Bundesland=\"Steiermark\",Auswahl_Jahr=2012),LOOKUP(B38,Dropdown_Bundesland!$F:$F,Dropdown_Bundesland!$Q:$Q),IF(Auswahl_Bundesland=\"Tirol\",LOOKUP(B38,Dropdown_Bundesland!$F:$F,Dropdown_Bundesland!$M:$M),IF(Auswahl_Bundesland=\"Vorarlberg\",LOOKUP(B38,Dropdown_Bundesland!$F:$F,Dropdown_Bundesland!$N:$N),IF(Auswahl_Bundesland=\"Wien\",LOOKUP(B38,Dropdown_Bundesland!$F:$F,Dropdown_Bundesland!$O:$O),\"\"))))))))))))","v":0},0,0,0,0,0,{"$error":"#N/A"},{"$error":"#N/A"},0,0," ",{"$error":"#N/A"}," "]
[{"$error":"#N/A"},10,{"$f":"IF(Auswahl_Bundesland=\"Burgenland\",LOOKUP(B39,Dropdown_Bundesland!$F:$F,Dropdown_Bundesland!$G:$G),IF(Auswahl_Bundesland=\"Kärnten\",LOOKUP(B39,Dropdown_Bundesland!$F:$F,Dropdown_Bundesland!$H:$H),IF(AND(Auswahl_Bundesland=\"Niederösterreich\",Auswahl_Jahr<=2016),LOOKUP(B39,Dropdown_Bundesland!$F:$F,Dropdown_Bundesland!$I:$I),IF(AND(Auswahl_Bundesland=\"Niederösterreich\",Auswahl_Jahr>=2017),LOOKUP(B39,Dropdown_Bundesland!$F:$F,Dropdown_Bundesland!$R:$R),IF(Auswahl_Bundesland=\"Oberösterreich\",LOOKUP(B39,Dropdown_Bundesland!$F:$F,Dropdown_Bundesland!$J:$J),IF(Auswahl_Bundesland=\"Salzburg\",LOOKUP(B39,Dropdown_Bundesland!$F:$F,Dropdown_Bundesland!$K:$K),IF(AND(Auswahl_Bundesland=\"Steiermark\",Auswahl_Jahr>2012),LOOKUP(B39,Dropdown_Bundesland!$F:$F,Dropdown_Bundesland!$L:$L),IF(AND(Auswahl_Bundesland=\"Steiermark\",Auswahl_Jahr<2012),LOOKUP(B39,Dropdown_Bundesland!$F:$F,Dropdown_Bundesland!$P:$P),IF(AND(Auswahl_Bundesland=\"Steiermark\",Auswahl_Jahr=2012),LOOKUP(B39,Dropdown_Bundesland!$F:$F,Dropdown_Bundesland!$Q:$Q),IF(Auswahl_Bundesland=\"Tirol\",LOOKUP(B39,Dropdown_Bundesland!$F:$F,Dropdown_Bundesland!$M:$M),IF(Auswahl_Bundesland=\"Vorarlberg\",LOOKUP(B39,Dropdown_Bundesland!$F:$F,Dropdown_Bundesland!$N:$N),IF(Auswahl_Bundesland=\"Wien\",LOOKUP(B39,Dropdown_Bundesland!$F:$F,Dropdown_Bundesland!$O:$O),\"\"))))))))))))","v":0},0,0,0,0,0,{"$error":"#N/A"},{"$error":"#N/A"},0,0," ",{"$error":"#N/A"}," "]
[{"$error":"#N/A"},11,{"$f":"IF(Auswahl_Bundesland=\"Burgenland\",LOOKUP(B40,Dropdown_Bundesland!$F:$F,Dropdown_Bundesland!$G:$G),IF(Auswahl_Bundesland=\"Kärnten\",LOOKUP(B40,Dropdown_Bundesland!$F:$F,Dropdown_Bundesland!$H:$H),IF(AND(Auswahl_Bundesland=\"Niederösterreich\",Auswahl_Jahr<=2016),LOOKUP(B40,Dropdown_Bundesland!$F:$F,Dropdown_Bundesland!$I:$I),IF(AND(Auswahl_Bundesland=\"Niederösterreich\",Auswahl_Jahr>=2017),LOOKUP(B40,Dropdown_Bundesland!$F:$F,Dropdown_Bundesland!$R:$R),IF(Auswahl_Bundesland=\"Oberösterreich\",LOOKUP(B40,Dropdown_Bundesland!$F:$F,Dropdown_Bundesland!$J:$J),IF(Auswahl_Bundesland=\"Salzburg\",LOOKUP(B40,Dropdown_Bundesland!$F:$F,Dropdown_Bundesland!$K:$K),IF(AND(Auswahl_Bundesland=\"Steiermark\",Auswahl_Jahr>2012),LOOKUP(B40,Dropdown_Bundesland!$F:$F,Dropdown_Bundesland!$L:$L),IF(AND(Auswahl_Bundesland=\"Steiermark\",Auswahl_Jahr<2012),LOOKUP(B40,Dropdown_Bundesland!$F:$F,Dropdown_Bundesland!$P:$P),IF(AND(Auswahl_Bundesland=\"Steiermark\",Auswahl_Jahr=2012),LOOKUP(B40,Dropdown_Bundesland!$F:$F,Dropdown_Bundesland!$Q:$Q),IF(Auswahl_Bundesland=\"Tirol\",LOOKUP(B40,Dropdown_Bundesland!$F:$F,Dropdown_Bundesland!$M:$M),IF(Auswahl_Bundesland=\"Vorarlberg\",LOOKUP(B40,Dropdown_Bundesland!$F:$F,Dropdown_Bundesland!$N:$N),IF(Auswahl_Bundesland=\"Wien\",LOOKUP(B40,Dropdown_Bundesland!$F:$F,Dropdown_Bundesland!$O:$O),\"\"))))))))))))","v":0},0,0,0,0,0,{"$error":"#N/A"},{"$error":"#N/A"},0,0," ",{"$error":"#N/A"}," "]
[{"$error":"#N/A"},12,{"$f":"IF(Auswahl_Bundesland=\"Burgenland\",LOOKUP(B41,Dropdown_Bundesland!$F:$F,Dropdown_Bundesland!$G:$G),IF(Auswahl_Bundesland=\"Kärnten\",LOOKUP(B41,Dropdown_Bundesland!$F:$F,Dropdown_Bundesland!$H:$H),IF(AND(Auswahl_Bundesland=\"Niederösterreich\",Auswahl_Jahr<=2016),LOOKUP(B41,Dropdown_Bundesland!$F:$F,Dropdown_Bundesland!$I:$I),IF(AND(Auswahl_Bundesland=\"Niederösterreich\",Auswahl_Jahr>=2017),LOOKUP(B41,Dropdown_Bundesland!$F:$F,Dropdown_Bundesland!$R:$R),IF(Auswahl_Bundesland=\"Oberösterreich\",LOOKUP(B41,Dropdown_Bundesland!$F:$F,Dropdown_Bundesland!$J:$J),IF(Auswahl_Bundesland=\"Salzburg\",LOOKUP(B41,Dropdown_Bundesland!$F:$F,Dropdown_Bundesland!$K:$K),IF(AND(Auswahl_Bundesland=\"Steiermark\",Auswahl_Jahr>2012),LOOKUP(B41,Dropdown_Bundesland!$F:$F,Dropdown_Bundesland!$L:$L),IF(AND(Auswahl_Bundesland=\"Steiermark\",Auswahl_Jahr<2012),LOOKUP(B41,Dropdown_Bundesland!$F:$F,Dropdown_Bundesland!$P:$P),IF(AND(Auswahl_Bundesland=\"Steiermark\",Auswahl_Jahr=2012),LOOKUP(B41,Dropdown_Bundesland!$F:$F,Dropdown_Bundesland!$Q:$Q),IF(Auswahl_Bundesland=\"Tirol\",LOOKUP(B41,Dropdown_Bundesland!$F:$F,Dropdown_Bundesland!$M:$M),IF(Auswahl_Bundesland=\"Vorarlberg\",LOOKUP(B41,Dropdown_Bundesland!$F:$F,Dropdown_Bundesland!$N:$N),IF(Auswahl_Bundesland=\"Wien\",LOOKUP(B41,Dropdown_Bundesland!$F:$F,Dropdown_Bundesland!$O:$O),\"\"))))))))))))","v":0},0,0,0,0,0,{"$error":"#N/A"},{"$error":"#N/A"},0,0," ",{"$error":"#N/A"}," "]
[{"$error":"#N/A"},13,{"$f":"IF(Auswahl_Bundesland=\"Burgenland\",LOOKUP(B42,Dropdown_Bundesland!$F:$F,Dropdown_Bundesland!$G:$G),IF(Auswahl_Bundesland=\"Kärnten\",LOOKUP(B42,Dropdown_Bundesland!$F:$F,Dropdown_Bundesland!$H:$H),IF(AND(Auswahl_Bundesland=\"Niederösterreich\",Auswahl_Jahr<=2016),LOOKUP(B42,Dropdown_Bundesland!$F:$F,Dropdown_Bundesland!$I:$I),IF(AND(Auswahl_Bundesland=\"Niederösterreich\",Auswahl_Jahr>=2017),LOOKUP(B42,Dropdown_Bundesland!$F:$F,Dropdown_Bundesland!$R:$R),IF(Auswahl_Bundesland=\"Oberösterreich\",LOOKUP(B42,Dropdown_Bundesland!$F:$F,Dropdown_Bundesland!$J:$J),IF(Auswahl_Bundesland=\"Salzburg\",LOOKUP(B42,Dropdown_Bundesland!$F:$F,Dropdown_Bundesland!$K:$K),IF(AND(Auswahl_Bundesland=\"Steiermark\",Auswahl_Jahr>2012),LOOKUP(B42,Dropdown_Bundesland!$F:$F,Dropdown_Bundesland!$L:$L),IF(AND(Auswahl_Bundesland=\"Steiermark\",Auswahl_Jahr<2012),LOOKUP(B42,Dropdown_Bundesland!$F:$F,Dropdown_Bundesland!$P:$P),IF(AND(Auswahl_Bundesland=\"Steiermark\",Auswahl_Jahr=2012),LOOKUP(B42,Dropdown_Bundesland!$F:$F,Dropdown_Bundesland!$Q:$Q),IF(Auswahl_Bundesland=\"Tirol\",LOOKUP(B42,Dropdown_Bundesland!$F:$F,Dropdown_Bundesland!$M:$M),IF(Auswahl_Bundesland=\"Vorarlberg\",LOOKUP(B42,Dropdown_Bundesland!$F:$F,Dropdown_Bundesland!$N:$N),IF(Auswahl_Bundesland=\"Wien\",LOOKUP(B42,Dropdown_Bundesland!$F:$F,Dropdown_Bundesland!$O:$O),\"\"))))))))))))","v":0},0,0,0,0,0,{"$error":"#N/A"},{"$error":"#N/A"},0,0," ",{"$error":"#N/A"}," "]
[{"$error":"#N/A"},14,{"$f":"IF(Auswahl_Bundesland=\"Burgenland\",LOOKUP(B43,Dropdown_Bundesland!$F:$F,Dropdown_Bundesland!$G:$G),IF(Auswahl_Bundesland=\"Kärnten\",LOOKUP(B43,Dropdown_Bundesland!$F:$F,Dropdown_Bundesland!$H:$H),IF(AND(Auswahl_Bundesland=\"Niederösterreich\",Auswahl_Jahr<=2016),LOOKUP(B43,Dropdown_Bundesland!$F:$F,Dropdown_Bundesland!$I:$I),IF(AND(Auswahl_Bundesland=\"Niederösterreich\",Auswahl_Jahr>=2017),LOOKUP(B43,Dropdown_Bundesland!$F:$F,Dropdown_Bundesland!$R:$R),IF(Auswahl_Bundesland=\"Oberösterreich\",LOOKUP(B43,Dropdown_Bundesland!$F:$F,Dropdown_Bundesland!$J:$J),IF(Auswahl_Bundesland=\"Salzburg\",LOOKUP(B43,Dropdown_Bundesland!$F:$F,Dropdown_Bundesland!$K:$K),IF(AND(Auswahl_Bundesland=\"Steiermark\",Auswahl_Jahr>2012),LOOKUP(B43,Dropdown_Bundesland!$F:$F,Dropdown_Bundesland!$L:$L),IF(AND(Auswahl_Bundesland=\"Steiermark\",Auswahl_Jahr<2012),LOOKUP(B43,Dropdown_Bundesland!$F:$F,Dropdown_Bundesland!$P:$P),IF(AND(Auswahl_Bundesland=\"Steiermark\",Auswahl_Jahr=2012),LOOKUP(B43,Dropdown_Bundesland!$F:$F,Dropdown_Bundesland!$Q:$Q),IF(Auswahl_Bundesland=\"Tirol\",LOOKUP(B43,Dropdown_Bundesland!$F:$F,Dropdown_Bundesland!$M:$M),IF(Auswahl_Bundesland=\"Vorarlberg\",LOOKUP(B43,Dropdown_Bundesland!$F:$F,Dropdown_Bundesland!$N:$N),IF(Auswahl_Bundesland=\"Wien\",LOOKUP(B43,Dropdown_Bundesland!$F:$F,Dropdown_Bundesland!$O:$O),\"\"))))))))))))","v":0},0,0,0,0,0,{"$error":"#N/A"},{"$error":"#N/A"},0,0," ",{"$error":"#N/A"}," "]
[{"$error":"#N/A"},15,{"$f":"IF(Auswahl_Bundesland=\"Burgenland\",LOOKUP(B44,Dropdown_Bundesland!$F:$F,Dropdown_Bundesland!$G:$G),IF(Auswahl_Bundesland=\"Kärnten\",LOOKUP(B44,Dropdown_Bundesland!$F:$F,Dropdown_Bundesland!$H:$H),IF(AND(Auswahl_Bundesland=\"Niederösterreich\",Auswahl_Jahr<=2016),LOOKUP(B44,Dropdown_Bundesland!$F:$F,Dropdown_Bundesland!$I:$I),IF(AND(Auswahl_Bundesland=\"Niederösterreich\",Auswahl_Jahr>=2017),LOOKUP(B44,Dropdown_Bundesland!$F:$F,Dropdown_Bundesland!$R:$R),IF(Auswahl_Bundesland=\"Oberösterreich\",LOOKUP(B44,Dropdown_Bundesland!$F:$F,Dropdown_Bundesland!$J:$J),IF(Auswahl_Bundesland=\"Salzburg\",LOOKUP(B44,Dropdown_Bundesland!$F:$F,Dropdown_Bundesland!$K:$K),IF(AND(Auswahl_Bundesland=\"Steiermark\",Auswahl_Jahr>2012),LOOKUP(B44,Dropdown_Bundesland!$F:$F,Dropdown_Bundesland!$L:$L),IF(AND(Auswahl_Bundesland=\"Steiermark\",Auswahl_Jahr<2012),LOOKUP(B44,Dropdown_Bundesland!$F:$F,Dropdown_Bundesland!$P:$P),IF(AND(Auswahl_Bundesland=\"Steiermark\",Auswahl_Jahr=2012),LOOKUP(B44,Dropdown_Bundesland!$F:$F,Dropdown_Bundesland!$Q:$Q),IF(Auswahl_Bundesland=\"Tirol\",LOOKUP(B44,Dropdown_Bundesland!$F:$F,Dropdown_Bundesland!$M:$M),IF(Auswahl_Bundesland=\"Vorarlberg\",LOOKUP(B44,Dropdown_Bundesland!$F:$F,Dropdown_Bundesland!$N:$N),IF(Auswahl_Bundesland=\"Wien\",LOOKUP(B44,Dropdown_Bundesland!$F:$F,Dropdown_Bundesland!$O:$O),\"\"))))))))))))","v":0},0,0,0,0,0,{"$error":"#N/A"},{"$error":"#N/A"},0,0," ",{"$error":"#N/A"}," "]
[{"$error":"#N/A"},16,{"$f":"IF(Auswahl_Bundesland=\"Burgenland\",LOOKUP(B45,Dropdown_Bundesland!$F:$F,Dropdown_Bundesland!$G:$G),IF(Auswahl_Bundesland=\"Kärnten\",LOOKUP(B45,Dropdown_Bundesland!$F:$F,Dropdown_Bundesland!$H:$H),IF(AND(Auswahl_Bundesland=\"Niederösterreich\",Auswahl_Jahr<=2016),LOOKUP(B45,Dropdown_Bundesland!$F:$F,Dropdown_Bundesland!$I:$I),IF(AND(Auswahl_Bundesland=\"Niederösterreich\",Auswahl_Jahr>=2017),LOOKUP(B45,Dropdown_Bundesland!$F:$F,Dropdown_Bundesland!$R:$R),IF(Auswahl_Bundesland=\"Oberösterreich\",LOOKUP(B45,Dropdown_Bundesland!$F:$F,Dropdown_Bundesland!$J:$J),IF(Auswahl_Bundesland=\"Salzburg\",LOOKUP(B45,Dropdown_Bundesland!$F:$F,Dropdown_Bundesland!$K:$K),IF(AND(Auswahl_Bundesland=\"Steiermark\",Auswahl_Jahr>2012),LOOKUP(B45,Dropdown_Bundesland!$F:$F,Dropdown_Bundesland!$L:$L),IF(AND(Auswahl_Bundesland=\"Steiermark\",Auswahl_Jahr<2012),LOOKUP(B45,Dropdown_Bundesland!$F:$F,Dropdown_Bundesland!$P:$P),IF(AND(Auswahl_Bundesland=\"Steiermark\",Auswahl_Jahr=2012),LOOKUP(B45,Dropdown_Bundesland!$F:$F,Dropdown_Bundesland!$Q:$Q),IF(Auswahl_Bundesland=\"Tirol\",LOOKUP(B45,Dropdown_Bundesland!$F:$F,Dropdown_Bundesland!$M:$M),IF(Auswahl_Bundesland=\"Vorarlberg\",LOOKUP(B45,Dropdown_Bundesland!$F:$F,Dropdown_Bundesland!$N:$N),IF(Auswahl_Bundesland=\"Wien\",LOOKUP(B45,Dropdown_Bundesland!$F:$F,Dropdown_Bundesland!$O:$O),\"\"))))))))))))","v":0},0,0,0,0,0,{"$error":"#N/A"},{"$error":"#N/A"},0,0," ",{"$error":"#N/A"}," "]
[{"$error":"#N/A"},17,{"$f":"IF(Auswahl_Bundesland=\"Burgenland\",LOOKUP(B46,Dropdown_Bundesland!$F:$F,Dropdown_Bundesland!$G:$G),IF(Auswahl_Bundesland=\"Kärnten\",LOOKUP(B46,Dropdown_Bundesland!$F:$F,Dropdown_Bundesland!$H:$H),IF(AND(Auswahl_Bundesland=\"Niederösterreich\",Auswahl_Jahr<=2016),LOOKUP(B46,Dropdown_Bundesland!$F:$F,Dropdown_Bundesland!$I:$I),IF(AND(Auswahl_Bundesland=\"Niederösterreich\",Auswahl_Jahr>=2017),LOOKUP(B46,Dropdown_Bundesland!$F:$F,Dropdown_Bundesland!$R:$R),IF(Auswahl_Bundesland=\"Oberösterreich\",LOOKUP(B46,Dropdown_Bundesland!$F:$F,Dropdown_Bundesland!$J:$J),IF(Auswahl_Bundesland=\"Salzburg\",LOOKUP(B46,Dropdown_Bundesland!$F:$F,Dropdown_Bundesland!$K:$K),IF(AND(Auswahl_Bundesland=\"Steiermark\",Auswahl_Jahr>2012),LOOKUP(B46,Dropdown_Bundesland!$F:$F,Dropdown_Bundesland!$L:$L),IF(AND(Auswahl_Bundesland=\"Steiermark\",Auswahl_Jahr<2012),LOOKUP(B46,Dropdown_Bundesland!$F:$F,Dropdown_Bundesland!$P:$P),IF(AND(Auswahl_Bundesland=\"Steiermark\",Auswahl_Jahr=2012),LOOKUP(B46,Dropdown_Bundesland!$F:$F,Dropdown_Bundesland!$Q:$Q),IF(Auswahl_Bundesland=\"Tirol\",LOOKUP(B46,Dropdown_Bundesland!$F:$F,Dropdown_Bundesland!$M:$M),IF(Auswahl_Bundesland=\"Vorarlberg\",LOOKUP(B46,Dropdown_Bundesland!$F:$F,Dropdown_Bundesland!$N:$N),IF(Auswahl_Bundesland=\"Wien\",LOOKUP(B46,Dropdown_Bundesland!$F:$F,Dropdown_Bundesland!$O:$O),\"\"))))))))))))","v":0},0,0,0,0,0,{"$error":"#N/A"},{"$error":"#N/A"},0,0," ",{"$error":"#N/A"}," "]
[{"$error":"#N/A"},18,{"$f":"IF(Auswahl_Bundesland=\"Burgenland\",LOOKUP(B47,Dropdown_Bundesland!$F:$F,Dropdown_Bundesland!$G:$G),IF(Auswahl_Bundesland=\"Kärnten\",LOOKUP(B47,Dropdown_Bundesland!$F:$F,Dropdown_Bundesland!$H:$H),IF(AND(Auswahl_Bundesland=\"Niederösterreich\",Auswahl_Jahr<=2016),LOOKUP(B47,Dropdown_Bundesland!$F:$F,Dropdown_Bundesland!$I:$I),IF(AND(Auswahl_Bundesland=\"Niederösterreich\",Auswahl_Jahr>=2017),LOOKUP(B47,Dropdown_Bundesland!$F:$F,Dropdown_Bundesland!$R:$R),IF(Auswahl_Bundesland=\"Oberösterreich\",LOOKUP(B47,Dropdown_Bundesland!$F:$F,Dropdown_Bundesland!$J:$J),IF(Auswahl_Bundesland=\"Salzburg\",LOOKUP(B47,Dropdown_Bundesland!$F:$F,Dropdown_Bundesland!$K:$K),IF(AND(Auswahl_Bundesland=\"Steiermark\",Auswahl_Jahr>2012),LOOKUP(B47,Dropdown_Bundesland!$F:$F,Dropdown_Bundesland!$L:$L),IF(AND(Auswahl_Bundesland=\"Steiermark\",Auswahl_Jahr<2012),LOOKUP(B47,Dropdown_Bundesland!$F:$F,Dropdown_Bundesland!$P:$P),IF(AND(Auswahl_Bundesland=\"Steiermark\",Auswahl_Jahr=2012),LOOKUP(B47,Dropdown_Bundesland!$F:$F,Dropdown_Bundesland!$Q:$Q),IF(Auswahl_Bundesland=\"Tirol\",LOOKUP(B47,Dropdown_Bundesland!$F:$F,Dropdown_Bundesland!$M:$M),IF(Auswahl_Bundesland=\"Vorarlberg\",LOOKUP(B47,Dropdown_Bundesland!$F:$F,Dropdown_Bundesland!$N:$N),IF(Auswahl_Bundesland=\"Wien\",LOOKUP(B47,Dropdown_Bundesland!$F:$F,Dropdown_Bundesland!$O:$O),\"\"))))))))))))","v":0},0,0,0,0,0,{"$error":"#N/A"},{"$error":"#N/A"},0,0," ",{"$error":"#N/A"}," "]
[{"$error":"#N/A"},19,{"$f":"IF(Auswahl_Bundesland=\"Burgenland\",LOOKUP(B48,Dropdown_Bundesland!$F:$F,Dropdown_Bundesland!$G:$G),IF(Auswahl_Bundesland=\"Kärnten\",LOOKUP(B48,Dropdown_Bundesland!$F:$F,Dropdown_Bundesland!$H:$H),IF(AND(Auswahl_Bundesland=\"Niederösterreich\",Auswahl_Jahr<=2016),LOOKUP(B48,Dropdown_Bundesland!$F:$F,Dropdown_Bundesland!$I:$I),IF(AND(Auswahl_Bundesland=\"Niederösterreich\",Auswahl_Jahr>=2017),LOOKUP(B48,Dropdown_Bundesland!$F:$F,Dropdown_Bundesland!$R:$R),IF(Auswahl_Bundesland=\"Oberösterreich\",LOOKUP(B48,Dropdown_Bundesland!$F:$F,Dropdown_Bundesland!$J:$J),IF(Auswahl_Bundesland=\"Salzburg\",LOOKUP(B48,Dropdown_Bundesland!$F:$F,Dropdown_Bundesland!$K:$K),IF(AND(Auswahl_Bundesland=\"Steiermark\",Auswahl_Jahr>2012),LOOKUP(B48,Dropdown_Bundesland!$F:$F,Dropdown_Bundesland!$L:$L),IF(AND(Auswahl_Bundesland=\"Steiermark\",Auswahl_Jahr<2012),LOOKUP(B48,Dropdown_Bundesland!$F:$F,Dropdown_Bundesland!$P:$P),IF(AND(Auswahl_Bundesland=\"Steiermark\",Auswahl_Jahr=2012),LOOKUP(B48,Dropdown_Bundesland!$F:$F,Dropdown_Bundesland!$Q:$Q),IF(Auswahl_Bundesland=\"Tirol\",LOOKUP(B48,Dropdown_Bundesland!$F:$F,Dropdown_Bundesland!$M:$M),IF(Auswahl_Bundesland=\"Vorarlberg\",LOOKUP(B48,Dropdown_Bundesland!$F:$F,Dropdown_Bundesland!$N:$N),IF(Auswahl_Bundesland=\"Wien\",LOOKUP(B48,Dropdown_Bundesland!$F:$F,Dropdown_Bundesland!$O:$O),\"\"))))))))))))","v":0},0,0,0,0,0,{"$error":"#N/A"},{"$error":"#N/A"},0,0," ",{"$error":"#N/A"}," "]
[{"$error":"#N/A"},20,{"$f":"IF(Auswahl_Bundesland=\"Burgenland\",LOOKUP(B49,Dropdown_Bundesland!$F:$F,Dropdown_Bundesland!$G:$G),IF(Auswahl_Bundesland=\"Kärnten\",LOOKUP(B49,Dropdown_Bundesland!$F:$F,Dropdown_Bundesland!$H:$H),IF(AND(Auswahl_Bundesland=\"Niederösterreich\",Auswahl_Jahr<=2016),LOOKUP(B49,Dropdown_Bundesland!$F:$F,Dropdown_Bundesland!$I:$I),IF(AND(Auswahl_Bundesland=\"Niederösterreich\",Auswahl_Jahr>=2017),LOOKUP(B49,Dropdown_Bundesland!$F:$F,Dropdown_Bundesland!$R:$R),IF(Auswahl_Bundesland=\"Oberösterreich\",LOOKUP(B49,Dropdown_Bundesland!$F:$F,Dropdown_Bundesland!$J:$J),IF(Auswahl_Bundesland=\"Salzburg\",LOOKUP(B49,Dropdown_Bundesland!$F:$F,Dropdown_Bundesland!$K:$K),IF(AND(Auswahl_Bundesland=\"Steiermark\",Auswahl_Jahr>2012),LOOKUP(B49,Dropdown_Bundesland!$F:$F,Dropdown_Bundesland!$L:$L),IF(AND(Auswahl_Bundesland=\"Steiermark\",Auswahl_Jahr<2012),LOOKUP(B49,Dropdown_Bundesland!$F:$F,Dropdown_Bundesland!$P:$P),IF(AND(Auswahl_Bundesland=\"Steiermark\",Auswahl_Jahr=2012),LOOKUP(B49,Dropdown_Bundesland!$F:$F,Dropdown_Bundesland!$Q:$Q),IF(Auswahl_Bundesland=\"Tirol\",LOOKUP(B49,Dropdown_Bundesland!$F:$F,Dropdown_Bundesland!$M:$M),IF(Auswahl_Bundesland=\"Vorarlberg\",LOOKUP(B49,Dropdown_Bundesland!$F:$F,Dropdown_Bundesland!$N:$N),IF(Auswahl_Bundesland=\"Wien\",LOOKUP(B49,Dropdown_Bundesland!$F:$F,Dropdown_Bundesland!$O:$O),\"\"))))))))))))","v":0},0,0,0,0,0,{"$error":"#N/A"},{"$error":"#N/A"},0,0," ",{"$error":"#N/A"}," "]
[{"$error":"#N/A"},21,{"$f":"IF(Auswahl_Bundesland=\"Burgenland\",LOOKUP(B50,Dropdown_Bundesland!$F:$F,Dropdown_Bundesland!$G:$G),IF(Auswahl_Bundesland=\"Kärnten\",LOOKUP(B50,Dropdown_Bundesland!$F:$F,Dropdown_Bundesland!$H:$H),IF(AND(Auswahl_Bundesland=\"Niederösterreich\",Auswahl_Jahr<=2016),LOOKUP(B50,Dropdown_Bundesland!$F:$F,Dropdown_Bundesland!$I:$I),IF(AND(Auswahl_Bundesland=\"Niederösterreich\",Auswahl_Jahr>=2017),LOOKUP(B50,Dropdown_Bundesland!$F:$F,Dropdown_Bundesland!$R:$R),IF(Auswahl_Bundesland=\"Oberösterreich\",LOOKUP(B50,Dropdown_Bundesland!$F:$F,Dropdown_Bundesland!$J:$J),IF(Auswahl_Bundesland=\"Salzburg\",LOOKUP(B50,Dropdown_Bundesland!$F:$F,Dropdown_Bundesland!$K:$K),IF(AND(Auswahl_Bundesland=\"Steiermark\",Auswahl_Jahr>2012),LOOKUP(B50,Dropdown_Bundesland!$F:$F,Dropdown_Bundesland!$L:$L),IF(AND(Auswahl_Bundesland=\"Steiermark\",Auswahl_Jahr<2012),LOOKUP(B50,Dropdown_Bundesland!$F:$F,Dropdown_Bundesland!$P:$P),IF(AND(Auswahl_Bundesland=\"Steiermark\",Auswahl_Jahr=2012),LOOKUP(B50,Dropdown_Bundesland!$F:$F,Dropdown_Bundesland!$Q:$Q),IF(Auswahl_Bundesland=\"Tirol\",LOOKUP(B50,Dropdown_Bundesland!$F:$F,Dropdown_Bundesland!$M:$M),IF(Auswahl_Bundesland=\"Vorarlberg\",LOOKUP(B50,Dropdown_Bundesland!$F:$F,Dropdown_Bundesland!$N:$N),IF(Auswahl_Bundesland=\"Wien\",LOOKUP(B50,Dropdown_Bundesland!$F:$F,Dropdown_Bundesland!$O:$O),\"\"))))))))))))","v":0},0,0,0,0,0,{"$error":"#N/A"},{"$error":"#N/A"},0,0," ",{"$error":"#N/A"}," "]
[{"$error":"#N/A"},22,{"$f":"IF(Auswahl_Bundesland=\"Burgenland\",LOOKUP(B51,Dropdown_Bundesland!$F:$F,Dropdown_Bundesland!$G:$G),IF(Auswahl_Bundesland=\"Kärnten\",LOOKUP(B51,Dropdown_Bundesland!$F:$F,Dropdown_Bundesland!$H:$H),IF(AND(Auswahl_Bundesland=\"Niederösterreich\",Auswahl_Jahr<=2016),LOOKUP(B51,Dropdown_Bundesland!$F:$F,Dropdown_Bundesland!$I:$I),IF(AND(Auswahl_Bundesland=\"Niederösterreich\",Auswahl_Jahr>=2017),LOOKUP(B51,Dropdown_Bundesland!$F:$F,Dropdown_Bundesland!$R:$R),IF(Auswahl_Bundesland=\"Oberösterreich\",LOOKUP(B51,Dropdown_Bundesland!$F:$F,Dropdown_Bundesland!$J:$J),IF(Auswahl_Bundesland=\"Salzburg\",LOOKUP(B51,Dropdown_Bundesland!$F:$F,Dropdown_Bundesland!$K:$K),IF(AND(Auswahl_Bundesland=\"Steiermark\",Auswahl_Jahr>2012),LOOKUP(B51,Dropdown_Bundesland!$F:$F,Dropdown_Bundesland!$L:$L),IF(AND(Auswahl_Bundesland=\"Steiermark\",Auswahl_Jahr<2012),LOOKUP(B51,Dropdown_Bundesland!$F:$F,Dropdown_Bundesland!$P:$P),IF(AND(Auswahl_Bundesland=\"Steiermark\",Auswahl_Jahr=2012),LOOKUP(B51,Dropdown_Bundesland!$F:$F,Dropdown_Bundesland!$Q:$Q),IF(Auswahl_Bundesland=\"Tirol\",LOOKUP(B51,Dropdown_Bundesland!$F:$F,Dropdown_Bundesland!$M:$M),IF(Auswahl_Bundesland=\"Vorarlberg\",LOOKUP(B51,Dropdown_Bundesland!$F:$F,Dropdown_Bundesland!$N:$N),IF(Auswahl_Bundesland=\"Wien\",LOOKUP(B51,Dropdown_Bundesland!$F:$F,Dropdown_Bundesland!$O:$O),\"\"))))))))))))","v":0},0,0,0,0,0,{"$error":"#N/A"},{"$error":"#N/A"},0,0," ",{"$error":"#N/A"}," "]
[{"$error":"#N/A"},23,{"$f":"IF(Auswahl_Bundesland=\"Burgenland\",LOOKUP(B52,Dropdown_Bundesland!$F:$F,Dropdown_Bundesland!$G:$G),IF(Auswahl_Bundesland=\"Kärnten\",LOOKUP(B52,Dropdown_Bundesland!$F:$F,Dropdown_Bundesland!$H:$H),IF(AND(Auswahl_Bundesland=\"Niederösterreich\",Auswahl_Jahr<=2016),LOOKUP(B52,Dropdown_Bundesland!$F:$F,Dropdown_Bundesland!$I:$I),IF(AND(Auswahl_Bundesland=\"Niederösterreich\",Auswahl_Jahr>=2017),LOOKUP(B52,Dropdown_Bundesland!$F:$F,Dropdown_Bundesland!$R:$R),IF(Auswahl_Bundesland=\"Oberösterreich\",LOOKUP(B52,Dropdown_Bundesland!$F:$F,Dropdown_Bundesland!$J:$J),IF(Auswahl_Bundesland=\"Salzburg\",LOOKUP(B52,Dropdown_Bundesland!$F:$F,Dropdown_Bundesland!$K:$K),IF(AND(Auswahl_Bundesland=\"Steiermark\",Auswahl_Jahr>2012),LOOKUP(B52,Dropdown_Bundesland!$F:$F,Dropdown_Bundesland!$L:$L),IF(AND(Auswahl_Bundesland=\"Steiermark\",Auswahl_Jahr<2012),LOOKUP(B52,Dropdown_Bundesland!$F:$F,Dropdown_Bundesland!$P:$P),IF(AND(Auswahl_Bundesland=\"Steiermark\",Auswahl_Jahr=2012),LOOKUP(B52,Dropdown_Bundesland!$F:$F,Dropdown_Bundesland!$Q:$Q),IF(Auswahl_Bundesland=\"Tirol\",LOOKUP(B52,Dropdown_Bundesland!$F:$F,Dropdown_Bundesland!$M:$M),IF(Auswahl_Bundesland=\"Vorarlberg\",LOOKUP(B52,Dropdown_Bundesland!$F:$F,Dropdown_Bundesland!$N:$N),IF(Auswahl_Bundesland=\"Wien\",LOOKUP(B52,Dropdown_Bundesland!$F:$F,Dropdown_Bundesland!$O:$O),\"\"))))))))))))","v":0},0,0,0,0,0,{"$error":"#N/A"},{"$error":"#N/A"},0,0," ",{"$error":"#N/A"}," "]
[{"$error":"#N/A"},24,{"$f":"IF(Auswahl_Bundesland=\"Burgenland\",LOOKUP(B53,Dropdown_Bundesland!$F:$F,Dropdown_Bundesland!$G:$G),IF(Auswahl_Bundesland=\"Kärnten\",LOOKUP(B53,Dropdown_Bundesland!$F:$F,Dropdown_Bundesland!$H:$H),IF(AND(Auswahl_Bundesland=\"Niederösterreich\",Auswahl_Jahr<=2016),LOOKUP(B53,Dropdown_Bundesland!$F:$F,Dropdown_Bundesland!$I:$I),IF(AND(Auswahl_Bundesland=\"Niederösterreich\",Auswahl_Jahr>=2017),LOOKUP(B53,Dropdown_Bundesland!$F:$F,Dropdown_Bundesland!$R:$R),IF(Auswahl_Bundesland=\"Oberösterreich\",LOOKUP(B53,Dropdown_Bundesland!$F:$F,Dropdown_Bundesland!$J:$J),IF(Auswahl_Bundesland=\"Salzburg\",LOOKUP(B53,Dropdown_Bundesland!$F:$F,Dropdown_Bundesland!$K:$K),IF(AND(Auswahl_Bundesland=\"Steiermark\",Auswahl_Jahr>2012),LOOKUP(B53,Dropdown_Bundesland!$F:$F,Dropdown_Bundesland!$L:$L),IF(AND(Auswahl_Bundesland=\"Steiermark\",Auswahl_Jahr<2012),LOOKUP(B53,Dropdown_Bundesland!$F:$F,Dropdown_Bundesland!$P:$P),IF(AND(Auswahl_Bundesland=\"Steiermark\",Auswahl_Jahr=2012),LOOKUP(B53,Dropdown_Bundesland!$F:$F,Dropdown_Bundesland!$Q:$Q),IF(Auswahl_Bundesland=\"Tirol\",LOOKUP(B53,Dropdown_Bundesland!$F:$F,Dropdown_Bundesland!$M:$M),IF(Auswahl_Bundesland=\"Vorarlberg\",LOOKUP(B53,Dropdown_Bundesland!$F:$F,Dropdown_Bundesland!$N:$N),IF(Auswahl_Bundesland=\"Wien\",LOOKUP(B53,Dropdown_Bundesland!$F:$F,Dropdown_Bundesland!$O:$O),\"\"))))))))))))","v":0},0,0,0,0,0,{"$error":"#N/A"},{"$error":"#N/A"},0,0," ",{"$error":"#N/A"}," "]
[null,null,{"$f":"Auswahl_Bundesland","v":"Burgenland"},{"$f":"SUM(D30:D53)","v":22368},{"$f":"SUM(E30:E53)","v":22037},{"$f":"D54*100/$D$54","v":100},{"$f":"IF(ISERROR(IF(Auswahl_Jahr<2002,0,TEXT(D54-E54,\"#.###\"))),IF(Auswahl_Jahr<2002,0,TEXT(D54-E54,\"# ###\")),IF(Auswahl_Jahr<2002,0,TEXT(D54-E54,\"#.###\")))","v":"331"},{"$f":"IF(Auswahl_Jahr<2002,0,TEXT((D54*100/E54)-100,\"##0,0\"))","v":"1,5"}]
[]
[null,null,{"$f":"Auswahl_Bezirk","v":"Oberpullendorf"},{"$f":"VLOOKUP($C$56,$C$30:$J$53,2,FALSE)","v":2785},{"$f":"VLOOKUP($C$56,$C$30:$J$53,3,FALSE)","v":2692},{"$f":"TEXT(VLOOKUP($C$56,$C$30:$J$53,4,FALSE),\"##0,0\")","v":"12,5"},{"$f":"IF(ISERROR(TEXT(VLOOKUP($C$56,$C$30:$J$53,5,FALSE),\"#.###\")),TEXT(VLOOKUP($C$56,$C$30:$J$53,5,FALSE),\"# ###\"),TEXT(VLOOKUP($C$56,$C$30:$J$53,5,FALSE),\"#.###\"))","v":"93"},{"$f":"TEXT(VLOOKUP($C$56,$C$30:$J$53,6,FALSE),\"##0,0\")","v":"3,5"},{"$f":"VLOOKUP($C$56,$C$30:$J$53,7,FALSE)","v":3.55},{"$f":"VLOOKUP($C$56,$C$30:$J$53,8,FALSE)","v":15000}]
[]
[]
[null,{"$f":"Auswahl_Bezirk","v":"Oberpullendorf"},{"$f":"VLOOKUP(Auswahl_Bezirk,$K$30:$L$53,2,FALSE)","v":12.450822603719599},null,null,{"$f":"Auswahl_Bezirk","v":"Oberpullendorf"},{"$f":"VLOOKUP(Auswahl_Bezirk,$K$30:$L$53,2,FALSE)","v":12.450822603719599},null,{"$f":"RANK(K59,L30:L53)","v":4},{"$f":"Auswahl_Bezirk","v":"Oberpullendorf"},{"$f":"VLOOKUP(Auswahl_Bezirk,$K$30:$L$53,2,FALSE)","v":12.450822603719599},1]
[{"$f":"I60","v":1},{"$f":"INDEX($K$30:$L$53,MATCH(LARGE($L$30:$L$53,A60),$L$30:$L$53,0),1)","v":"Neusiedl am See"},{"$f":"INDEX($K$30:$L$53,MATCH(LARGE($L$30:$L$53,A60),$L$30:$L$53,0),2)","v":21.092632331902717},null,{"$f":"I60","v":1},{"$f":"INDEX($K$30:$L$53,MATCH(LARGE($L$30:$L$53,E60),$L$30:$L$53,0),1)","v":"Neusiedl am See"},{"$f":"INDEX($K$30:$L$53,MATCH(LARGE($L$30:$L$53,E60),$L$30:$L$53,0),2)","v":21.092632331902717},null,{"$f":"IF(L59<$I$59,L59,L59+1)","v":1},null,null,2]
[{"$f":"I61","v":2},"Eisenstadt-Umgebung",21.07027896995708,null,{"$f":"I61","v":2},"Eisenstadt-Umgebung",21.07027896995708,null,{"$f":"IF(L60<$I$59,L60,L60+1)","v":2},null,null,3]
[3,"Oberwart",17.623390557939913,null,3,"Oberwart",17.623390557939913,null,3,null,null,4]
[5,"Mattersburg",12.29881974248927,null,5,"Mattersburg",12.29881974248927,null,5,null,null,5]
[6,"Güssing",8.0293276108726754,null,6,"Güssing",8.0293276108726754,null,6,null,null,6]
[7,"Jennersdorf",7.4347281831187413,null,7,"Jennersdorf",7.4347281831187413,null,7,null,null,7]
[8,0,0,null,8,0,0,null,8,null,null,8]
[9,0,0,null,9,0,0,null,9,null,null,9]
[10,0,0,null,10,"Restliche Bezirke",{"$f":"G69-SUM(G59:G67)","v":0},null,10,null,null,10]
[null,null,null,null,11,"Summe",100]

{"sheet":"olap_bm","index":5,"n_rows":401,"n_cols":31,"rows_kept":401,"cut":false,"hidden":true,"merged":[]}
[null,null,null,null,null,1,2,3,4,5,6,7,8,9,10,11,12,13,14,15,16,17,18,19,20,21,22,23,24,25,26]
["BLD_Bez","Zeilenindex","Bez_Nr","Land_Bez","Bez_Mgst","Bez_STAT",2001,2002,2003,2004,2005,2006,2007,2008,2009,2010,2011,2012,2013,2014,2015,2016,2017,2018,2019,2020,2021,2022,2023,2024,2025]
[{"$f":"C3&D3&F3","v":{"$error":"#N/A"}},3,"aktive","Burgenland","0 -im Bundesland gültig",{"$error":"#N/A"},0,2,6,90,13,16,34,43,38,38,43,35,39,44,14,22,51,49,50,43,42,50,54,56,56]
[{"$f":"C4&D4&F4","v":"aktiveBurgenlandEisenstadt-Umgebung"},4,"aktive","Burgenland","1 -Eisenstadt-Umgebung","Eisenstadt-Umgebung",2241,2344,2442,2589,2703,2745,2818,3116,3286,3521,3627,3677,3801,3870,4007,4054,4095,4181,4289,4311,4498,4506,4542,4618,4713]
["aktiveBurgenlandNeusiedl am See",5,"aktive","Burgenland","2 -Neusiedl am See","Neusiedl am See",1903,2013,2115,2203,2304,2330,2447,2632,2768,2976,3132,3373,3493,3638,3741,3968,4035,4210,4246,4332,4415,4593,4654,4685,4718]
["aktiveBurgenlandMattersburg",6,"aktive","Burgenland","3 -Mattersburg","Mattersburg",1386,1419,1459,1494,1579,1647,1702,1818,1919,2026,2025,2068,2116,2219,2250,2322,2352,2413,2435,2487,2554,2598,2600,2662,2751]
["aktiveBurgenlandOberpullendorf",7,"aktive","Burgenland","4 -Oberpullendorf","Oberpullendorf",1373,1340,1402,1470,1498,1574,1580,1735,1794,1894,2011,2061,2067,2182,2230,2317,2297,2355,2399,2486,2536,2626,2669,2692,2785]
["aktiveBurgenlandOberwart",8,"aktive","Burgenland","5 -Oberwart","Oberwart",1926,1998,2072,2131,2224,2296,2372,2611,2728,2901,3092,3211,3253,3283,3343,3368,3439,3560,3678,3772,3816,3845,3992,3994,3942]
["aktiveBurgenlandGüssing",9,"aktive","Burgenland","6 -Güssing","Güssing",843,905,949,1025,1057,1097,1141,1223,1279,1371,1409,1512,1590,1708,1832,1883,1902,1917,1925,1890,1876,1816,1798,1777,1796]
["aktiveBurgenlandJennersdorf",10,"aktive","Burgenland","7 -Jennersdorf","Jennersdorf",557,580,609,605,622,653,697,743,771,821,861,891,899,939,1075,1180,1256,1276,1328,1335,1399,1507,1514,1609,1663]
[{"$error":"#N/A"},11,"aktive","Kärnten","0 -im Bundesland gültig",{"$error":"#N/A"},0,0,8,76,0,0,0,0,0,1,0,0,1,2,0,0,0,0,null,null,1]
["aktiveKärntenFeldkirchen",12,"aktive","Kärnten","1 -Pol.Bez. Feldkirchen","Feldkirchen",1174,1197,1220,1241,1290,1365,1402,1448,1456,1482,1565,1574,1646,1826,1895,1948,1909,1976,2015,2041,2106,2123,2155,2183,2232]
["aktiveKärntenHermagor",13,"aktive","Kärnten","2 -Pol.Bez. Hermagor","Hermagor",772,793,795,816,837,847,893,914,923,958,960,974,1009,1050,1065,1084,1133,1150,1172,1185,1208,1265,1308,1357,1440]
["aktiveKärntenKlagenfurt-Land",14,"aktive","Kärnten","3 -Pol.Bez. Klagenfurt-Land","Klagenfurt-Land",2132,2209,2273,2319,2405,2481,2508,2585,2673,2702,2817,2945,3084,3224,3312,3400,3442,3530,3655,3807,3920,3975,4042,4134,4235]
["aktiveKärntenKlagenfurt am Wörthersee",15,"aktive","Kärnten","4 -Statutarstadt Klagenfurt","Klagenfurt am Wörthersee",5037,5140,5272,5422,5534,5682,5824,5949,6119,6154,6254,6476,6730,6982,7037,7149,7309,7517,7666,7925,8139,8275,8388,8505,8634]
["aktiveKärntenSankt Veit an der Glan",16,"aktive","Kärnten","5 -Pol.Bez. Sankt Veit an der Glan","Sankt Veit an der Glan",1946,2030,2044,2068,2114,2164,2234,2309,2364,2436,2573,2627,2741,2891,2999,3132,3222,3264,3272,3272,3332,3328,3436,3511,3562]
["aktiveKärntenSpittal an der Drau",17,"aktive","Kärnten","6 -Pol.Bez. Spittal an der Drau","Spittal an der Drau",3266,3227,3351,3394,3449,3536,3598,3687,3761,3819,3938,4025,4198,4266,4383,4452,4504,4627,4691,4782,4990,5049,5156,5305,5371]
["aktiveKärntenVillach-Land",18,"aktive","Kärnten","7 -Pol.Bez. Villach-Land","Villach-Land",2311,2388,2463,2548,2634,2723,2800,2883,2957,3036,3110,3207,3300,3486,3571,3698,3751,3851,3853,3944,4075,4172,4348,4496,4512]
["aktiveKärntenVillach",19,"aktive","Kärnten","8 -Statutarstadt Villach","Villach",2711,2796,2857,2879,2999,3079,3173,3305,3410,3400,3484,3575,3661,3756,3830,3854,3903,3982,4051,4164,4267,4345,4403,4471,4573]
["aktiveKärntenVölkermarkt",20,"aktive","Kärnten","9 -Pol.Bez. Völkermarkt","Völkermarkt",1555,1588,1616,1654,1717,1747,1821,1830,1851,1871,1881,1905,2017,2116,2159,2195,2252,2340,2344,2400,2494,2529,2552,2601,2702]
["aktiveKärntenWolfsberg",21,"aktive","Kärnten","10-Pol.Bez. Wolfsberg","Wolfsberg",1807,1852,1937,1972,2081,2136,2181,2249,2253,2302,2385,2534,2718,2789,2829,3083,3113,3197,3225,3276,3367,3257,3291,3311,3816]
[{"$error":"#N/A"},22,"aktive","Niederösterreich","0 -im Bundesland gültig",{"$error":"#N/A"},0,0,0,101,28,0,7,2,5,12,19,8,1,0,0,0,0,0]
["aktiveNiederösterreichAmstetten",23,"aktive","Niederösterreich","1 -Amstetten","Amstetten",3687,3821,4117,4263,4422,4627,4829,5223,5366,5532,5745,6036,6372,6633,6930,7159,7322,7420,7520,7604,7792,7777,7750,7848,8121]
["aktiveNiederösterreichBaden",24,"aktive","Niederösterreich","2 -Baden","Baden",5293,5551,5769,6113,6472,6673,6875,7231,7424,7708,7852,8087,8416,8618,8857,9054,9167,9328,9599,9917,10238,10302,10553,10649,10888]
["aktiveNiederösterreichBruck an der Leitha",25,"aktive","Niederösterreich","3 -Bruck/Leitha","Bruck an der Leitha",1320,1372,1447,1515,1535,1623,1738,1901,2013,2124,2187,2269,2336,2427,2538,2596,7001,7158,7425,7772,8179,8797,9183,9435,9692]
["aktiveNiederösterreichGänserndorf",26,"aktive","Niederösterreich","4 -Gänserndorf","Gänserndorf",2708,2825,2956,3142,3299,3415,3517,3928,4095,4383,4471,4659,4787,4929,5092,5300,5426,5499,5607,5659,5888,5946,6102,6193,6324]
["aktiveNiederösterreichGmünd",27,"aktive","Niederösterreich","5 -Gmünd","Gmünd",1407,1436,1441,1454,1454,1508,1515,1584,1607,1654,1723,1731,1811,1885,1945,1960,2012,2070,2098,2136,2243,2251,2271,2305,2342]
["aktiveNiederösterreichHollabrunn",28,"aktive","Niederösterreich","6 -Hollabrunn","Hollabrunn",1417,1482,1509,1568,1630,1738,1798,1943,2004,2075,2160,2235,2338,2394,2523,2622,2688,2722,2771,2879,2987,3063,3085,3146,3192]
["aktiveNiederösterreichHorn",29,"aktive","Niederösterreich","7 -Horn","Horn",1146,1152,1196,1237,1277,1318,1372,1465,1489,1570,1658,1764,1852,1962,2011,2102,2179,2190,2233,2227,2238,2316,2275,2271,2269]
["aktiveNiederösterreichKorneuburg",30,"aktive","Niederösterreich","8 -Korneuburg","Korneuburg",2736,2818,2911,3071,3220,3355,3414,3674,3854,3985,4157,4354,4546,4666,4807,5009,6039,6152,6256,6426,6615,6738,6943,6972,6963]
["aktiveNiederösterreichKrems-Land",31,"aktive","Niederösterreich","9 -Krems/Donau (Land)","Krems-Land",2809,2856,2953,3081,3160,3294,3409,3738,3943,4205,4235,4400,4520,4627,4777,4925,5028,5092,5187,5288,5333,5413,5364,5387,5526]
["aktiveNiederösterreichLilienfeld",32,"aktive","Niederösterreich","10-Lilienfeld","Lilienfeld",971,992,1010,1033,1086,1110,1149,1235,1266,1313,1362,1392,1442,1486,1521,1560,1563,1587,1616,1623,1686,1681,1674,1697,1712]
["aktiveNiederösterreichMelk",33,"aktive","Niederösterreich","11-Melk","Melk",2533,2615,2736,2782,2834,2910,3002,3269,3334,3477,3645,3817,3972,4139,4336,4456,4608,4669,4782,4800,4939,5070,5116,5221,5337]
["aktiveNiederösterreichMistelbach",34,"aktive","Niederösterreich","12-Mistelbach","Mistelbach",2132,2193,2327,2466,2527,2571,2671,3005,3231,3372,3519,3671,3902,4137,4338,4462,4654,4746,4805,4814,4993,5073,5110,5116,5148]
["aktiveNiederösterreichMödling",35,"aktive","Niederösterreich","13-Mödling","Mödling",5939,6194,6435,6680,6997,7181,7456,7990,8330,8633,8865,9155,9293,9495,9818,9954,10075,10123,10314,10399,10530,10273,10316,10480,10633]
["aktiveNiederösterreichNeunkirchen",36,"aktive","Niederösterreich","14-Neunkirchen","Neunkirchen",2975,3036,3083,3179,3224,3323,3446,3729,3880,3991,4145,4290,4429,4603,4737,4805,4923,4945,4986,5085,5198,5247,5318,5443,5524]
["aktiveNiederösterreichSankt Pölten-Land",37,"aktive","Niederösterreich","15-Sankt Pölten (Land)","Sankt Pölten-Land",5347,5505,5698,5925,6041,6210,6396,6887,7128,7523,7995,8232,8486,8716,8835,9057,11239,11405,11623,11889,12268,12505,12742,12946,13349]
["aktiveNiederösterreichScheibbs",38,"aktive","Niederösterreich","16-Scheibbs","Scheibbs",1369,1375,1445,1495,1534,1598,1630,1709,1790,1880,1992,2043,2105,2187,2244,2324,2404,2493,2534,2637,2793,2824,2845,2941,3058]
["aktiveNiederösterreichTulln",39,"aktive","Niederösterreich","17-Tulln","Tulln",2300,2393,2518,2649,2785,2901,3053,3317,3446,3612,3805,3992,4186,4355,4524,4709,6960,7069,7187,7381,7656,7710,7853,7948,8073]
["aktiveNiederösterreichWaidhofen an der Thaya",40,"aktive","Niederösterreich","18-Waidhofen/Thaya","Waidhofen an der Thaya",987,1012,1020,1032,1037,1042,1062,1105,1132,1176,1190,1220,1235,1261,1334,1356,1402,1419,1443,1470,1552,1614,1709,1759,1806]
["aktiveNiederösterreichWiener Neustadt-Land",41,"aktive","Niederösterreich","19-Wiener Neustadt (Land)","Wiener Neustadt-Land",4328,4474,4661,4887,5077,5219,5393,5740,6132,6540,6862,7115,7312,7585,8044,8398,8639,8806,8905,8995,9380,9456,9517,9655,9855]
["aktiveNiederösterreichWien-Umgebung",42,"aktive","Niederösterreich","20-Wien-Umgebung","Wien-Umgebung",4596,4815,5064,5286,5502,5632,5873,6290,6589,7065,7271,7657,8075,8460,8724,9074,0,0]
["aktiveNiederösterreichZwettl",43,"aktive","Niederösterreich","21-Zwettl","Zwettl",1538,1546,1582,1618,1666,1702,1752,1840,1902,1946,2047,2111,2203,2276,2398,2528,2585,2590,2647,2584,2650,2611,2636,2644,2658]
[{"$error":"#N/A"},44,"aktive","Niederösterreich","99-im Bundesland gültig",{"$error":"#N/A"},144,144,148,134,137,134,133,135,122,116,111,113,114,113,119,113,111,111,121,123,126,130,132,131,136]
[{"$error":"#N/A"},45,"aktive","Oberösterreich","0 -im Bundesland gültig",{"$error":"#N/A"},0,2,0,91,15,0,2,1,0,0,0,0,0,1,0,0,0,0,null,null,null,null,null,null,1]
["aktiveOberösterreichLinz",46,"aktive","Oberösterreich","1 -Statutarstadt Linz/Donau","Linz",8259,8437,8658,8896,9062,9281,9361,10000,10246,10510,10689,10879,11148,11468,11689,11927,11958,12040,12118,12325,12656,12703,12797,12863,13139]
["aktiveOberösterreichSteyr",47,"aktive","Oberösterreich","2 -Statutarstadt Steyr","Steyr",1551,1580,1645,1685,1705,1715,1721,1837,1916,1977,2022,1989,2030,2084,2135,2134,2115,2089,2088,2158,2211,2162,2194,2077,2125]
["aktiveOberösterreichWels",48,"aktive","Oberösterreich","3 -Statutarstadt Wels","Wels",2827,2860,2927,2928,3013,3097,3135,3857,3923,3987,4052,4064,4092,4097,4064,4027,4071,4093,4091,4031,4112,4170,4131,4172,4135]
["aktiveOberösterreichBraunau am Inn",49,"aktive","Oberösterreich","4 -Pol.Bez. Braunau am Inn","Braunau am Inn",3060,3191,3224,3348,3480,3510,3616,3823,3975,4085,4249,4361,4467,4652,4740,4895,4969,5067,5175,5304,5508,5567,5673,5712,5946]
["aktiveOberösterreichEferding",50,"aktive","Oberösterreich","5 -Pol.Bez. Eferding","Eferding",999,1041,1094,1109,1125,1163,1220,1277,1347,1417,1483,1518,1571,1623,1656,1713,1726,1802,1835,1898,1971,2004,2038,2145,2190]
["aktiveOberösterreichFreistadt",51,"aktive","Oberösterreich","6 -Pol.Bez. Freistadt","Freistadt",1782,1835,1948,2022,2102,2153,2279,2382,2473,2557,2620,2679,2776,2858,2995,3118,3220,3239,3340,3434,3569,3739,3741,3831,3886]
["aktiveOberösterreichGmunden",52,"aktive","Oberösterreich","7 -Pol.Bez. Gmunden","Gmunden",3929,4050,4123,4269,4443,4562,4697,4977,5094,5231,5393,5480,5675,5845,5958,6101,6352,6382,6443,6586,6889,7058,7094,7168,7343]
["aktiveOberösterreichGrieskirchen",53,"aktive","Oberösterreich","8 -Pol.Bez. Grieskirchen","Grieskirchen",2085,2161,2253,2304,2387,2407,2439,2500,2613,2724,2798,2898,3028,3149,3324,3406,3527,3598,3640,3686,3776,3931,4031,4107,4220]
["aktiveOberösterreichKirchdorf an der Krems",54,"aktive","Oberösterreich","9 -Pol.Bez. Kirchdorf an der Krems","Kirchdorf an der Krems",1987,2053,2185,2268,2365,2431,2455,2522,2594,2678,2725,2761,2794,2882,2957,3010,3103,3140,3253,3328,3430,3494,3516,3583,3725]
["aktiveOberösterreichLinz-Land",55,"aktive","Oberösterreich","10-Pol.Bez. Linz-Land","Linz-Land",5138,5342,5464,5682,5927,6047,6165,6561,6885,7119,7308,7401,7584,7798,7953,8041,8327,8440,8568,8882,9089,9160,9203,9299,9465]
["aktiveOberösterreichPerg",56,"aktive","Oberösterreich","11-Pol.Bez. Perg","Perg",1828,1895,1998,2070,2164,2231,2315,2476,2547,2608,2679,2768,2913,3015,3158,3262,3319,3441,3441,3598,3814,3916,3984,4074,4148]
["aktiveOberösterreichRied im Innkreis",57,"aktive","Oberösterreich","12-Pol.Bez. Ried im Innkreis","Ried im Innkreis",1993,2066,2189,2248,2303,2359,2409,2545,2620,2652,2703,2793,2844,2964,3076,3116,3177,3246,3293,3429,3509,3551,3614,3599,3706]
["aktiveOberösterreichRohrbach",58,"aktive","Oberösterreich","13-Pol.Bez. Rohrbach","Rohrbach",1582,1664,1755,1793,1836,1884,1938,2013,2061,2154,2215,2263,2344,2422,2523,2633,2772,2806,2853,2933,3008,3063,3128,3149,3215]
["aktiveOberösterreichSchärding",59,"aktive","Oberösterreich","14-Pol.Bez. Schärding","Schärding",1695,1734,1831,1870,1966,2023,2100,2172,2265,2305,2325,2391,2471,2572,2693,2734,2846,2918,2959,3089,3205,3212,3269,3303,3408]
["aktiveOberösterreichSteyr-Land",60,"aktive","Oberösterreich","15-Pol.Bez. Steyr-Land","Steyr-Land",1945,2004,2077,2186,2247,2306,2380,2488,2596,2660,2756,2819,2883,2938,3054,3157,3217,3309,3347,3399,3511,3559,3583,3682,3834]
["aktiveOberösterreichUrfahr-Umgebung",61,"aktive","Oberösterreich","16-Pol.Bez. Urfahr-Umgebung","Urfahr-Umgebung",2360,2454,2592,2683,2780,2885,2961,3535,3749,3886,3994,4159,4276,4460,4564,4661,4810,4999,5091,5322,5461,5585,5638,5782,5949]
["aktiveOberösterreichVöcklabruck",62,"aktive","Oberösterreich","17-Pol.Bez. Vöcklabruck","Vöcklabruck",4665,4805,4994,5144,5199,5359,5482,6158,6389,6663,6739,6944,7346,7591,7855,8136,8266,8302,8440,8667,8961,9202,9283,9447,9614]
["aktiveOberösterreichWels-Land",63,"aktive","Oberösterreich","18-Pol.Bez. Wels-Land","Wels-Land",2263,2388,2467,2605,2726,2840,2881,3039,3182,3290,3424,3547,3714,3885,4042,4170,4292,4418,4557,4712,4870,4899,4961,5045,5199]
[{"$error":"#N/A"},64,"aktive","Salzburg","0 -im Bundesland gültig",{"$error":"#N/A"},0,1,1,7,12,0,1,0,0,0,0,0,0,0,0,0,4,36,46,44,40,42,52,56,72]
["aktiveSalzburgSalzburg",65,"aktive","Salzburg","1 -Stadt Salzburg","Salzburg",8465,8585,8811,8976,9102,9253,9461,9802,10039,10327,10553,10691,10841,11010,11137,11416,11466,11670,11819,11943,12249,12327,12352,12492,12641]
["aktiveSalzburgHallein",66,"aktive","Salzburg","2 -Pol.Bez. Hallein","Hallein",2335,2401,2517,2585,2650,2700,2798,2876,2929,3000,3115,3166,3326,3424,3522,3594,3685,3767,3818,3886,3992,4069,4052,4090,4151]
["aktiveSalzburgSalzburg-Umgebung",67,"aktive","Salzburg","3 -Pol.Bez. Salzburg-Umgebung","Salzburg-Umgebung",6470,6663,6945,7194,7350,7488,7664,8008,8231,8489,8659,8920,9162,9395,9711,9875,9983,10209,10382,10612,11036,11159,11386,11647,11801]
[{"$f":"C68&D68&F68","v":"aktiveSalzburgSankt Johann im Pongau"},68,"aktive","Salzburg","4 -Pol.Bez. Sankt Johann im Pongau","Sankt Johann im Pongau",3825,3877,3903,3990,4060,4148,4283,4356,4414,4512,4662,4805,4851,5009,5073,5174,5237,5299,5372,5402,5676,5748,5920,5986,6107]
["aktiveSalzburgTamsweg",69,"aktive","Salzburg","5 -Pol.Bez. Tamsweg","Tamsweg",881,880,891,921,907,918,941,979,988,1006,1033,1042,1063,1118,1164,1166,1196,1208,1232,1251,1305,1325,1376,1384,1431]
["aktiveSalzburgZell am See",70,"aktive","Salzburg","6 -Pol.Bez. Zell am See","Zell am See",4176,4253,4387,4451,4562,4643,4712,4846,4902,5038,5169,5298,5395,5596,5767,5905,6022,6197,6367,6422,6691,6904,7053,7237,7332]
[{"$error":"#N/A"},71,"aktive","Salzburg","10-unbekannt",{"$error":"#N/A"},0,0,0,1,0,0,0,0,0,0,0,0,0,0,0,0,0,0]
[{"$error":"#N/A"},72,"aktive","Steiermark","0 -im Bundesland gültig",{"$error":"#N/A"},0,0,14,198,18,0,0,0,0,0,0,0,0,0,1,0,0,0]
["aktiveSteiermarkGraz",73,"aktive","Steiermark","1 -Graz-Stadt","Graz",11498,11944,12341,12648,13163,13516,13843,14510,14922,15406,15824,16208,16681,17084,17368,17417,17869,18352,18669,19491,20342,20478,20659,21020,21389]
["aktiveSteiermarkBruck an der Mur",74,"aktive","Steiermark","2 -Bruck an der Mur","Bruck an der Mur",2063,2110,2174,2208,2259,2264,2303,2398,2476,2513,2547,2824,0,0,0,0,0,0]
["aktiveSteiermarkDeutschlandsberg",75,"aktive","Steiermark","3 -Deutschlandsberg","Deutschlandsberg",2224,2372,2426,2526,2593,2698,2765,2963,3082,3207,3241,3319,3506,3589,3751,3929,3995,4079,4147,4194,4260,4220,4301,4377,4463]
["aktiveSteiermarkFeldbach",76,"aktive","Steiermark","4 -Feldbach","Feldbach",2123,2238,2297,2379,2480,2489,2550,2709,2762,2848,2948,3003,0,0,0,0,0,0]
["aktiveSteiermarkFürstenfeld",77,"aktive","Steiermark","5 -Fürstenfeld","Fürstenfeld",1008,1039,1098,1099,1134,1175,1208,1244,1288,1307,1339,1387,0,0,0,0,0,0]
["aktiveSteiermarkGraz-Umgebung",78,"aktive","Steiermark","6 -Graz-Umgebung","Graz-Umgebung",4705,4947,5290,5628,5964,6262,6497,6910,7180,7422,7731,7944,8157,8520,8922,9515,9901,10104,10367,10654,11059,11401,11601,11700,11789]
["aktiveSteiermarkHartberg",79,"aktive","Steiermark","7 -Hartberg","Hartberg",2210,2348,2427,2497,2598,2715,2796,2948,3075,3268,3450,3604,0,0,0,0,0,0]
["aktiveSteiermarkJudenburg",80,"aktive","Steiermark","8 -Judenburg","Judenburg",1674,1684,1729,1743,1794,1838,1881,1964,1987,2075,2101,0,0,0,0,0,0,0]
["aktiveSteiermarkLeibnitz",81,"aktive","Steiermark","9 -Leibnitz","Leibnitz",2689,2795,2890,3040,3199,3279,3352,3494,3583,3741,3850,3945,4139,4391,4546,4745,4975,5132,5309,5637,5849,5970,6149,6294,6356]
["aktiveSteiermarkLeoben",82,"aktive","Steiermark","10-Leoben","Leoben",2193,2231,2286,2353,2433,2440,2503,2565,2656,2822,2899,2951,3063,3080,3149,3207,3293,3305,3334,3287,3344,3358,3439,3486,3527]
["aktiveSteiermarkLiezen",83,"aktive","Steiermark","11-Liezen","Liezen",1650,1685,1738,1739,1826,1874,1946,2060,2044,2130,2167,2931,3023,3234,3279,3362,3407,3396,3433,3465,3514,3491,3551,3687,3784]
["aktiveSteiermarkMürzzuschlag",84,"aktive","Steiermark","12-Mürzzuschlag","Mürzzuschlag",1422,1453,1485,1488,1533,1540,1589,1603,1601,1629,1679,1695,0,0,0,0,0,0]
["aktiveSteiermarkMurau",85,"aktive","Steiermark","13-Murau","Murau",1054,1070,1102,1103,1152,1177,1199,1252,1291,1312,1366,1417,1464,1521,1565,1600,1595,1615,1624,1640,1699,1739,1783,1828,1824]
["aktiveSteiermarkRadkersburg",86,"aktive","Steiermark","14-Radkersburg","Radkersburg",809,818,864,890,948,954,957,999,1014,1060,1053,1096,0,0,0,0,0,0]
["aktiveSteiermarkGröbming",87,"aktive","Steiermark","15-Gröbming","Gröbming",1266,1281,1288,1302,1318,1359,1383,1429,1480,1530,1569,1592,1640,1668,1690,1740,1734,1779,1806,1829,1932,1971,2039,2092,2157]
["aktiveSteiermarkVoitsberg",88,"aktive","Steiermark","16-Voitsberg","Voitsberg",1988,2086,2175,2200,2259,2261,2285,2384,2444,2590,2620,2766,2806,2816,2890,2985,3104,3140,3196,3319,3300,3364,3376,3423,3492]
["aktiveSteiermarkWeiz",89,"aktive","Steiermark","17-Weiz","Weiz",2853,2953,3127,3226,3337,3485,3634,3729,3886,4014,4084,4231,4480,4718,4915,5156,5387,5925,6264,6637,7062,7210,7374,7454,7777]
["aktiveSteiermarkBad Aussee",90,"aktive","Steiermark","18-Bad Aussee","Bad Aussee",575,595,621,650,655,692,697,725,724,733,749,0,0,0,0,0,0,0]
["aktiveSteiermarkKnittelfeld",91,"aktive","Steiermark","19-Knittelfeld","Knittelfeld",946,979,1015,1020,1068,1082,1087,1144,1146,1171,1207,0,0,0,0,0,0,0]
["aktiveSteiermarkMariazell",92,"aktive","Steiermark","20-Mariazell","Mariazell",274,269,274,290,275,283,288,296,295,293,299,0,0,0,0,0,0,0]
["aktiveSteiermarkMurtal",93,"aktive","Steiermark","21-Murtal","Murtal",0,0,0,0,0,0,0,0,0,0,{"$f":"22+Q80+Q91","v":3330},3392,3647,3946,4156,4344,4440,4526,4557,4721,4769,4941,4949,5226,4982]
["aktiveSteiermarkBruck-Mürzzuschlag",94,"aktive","Steiermark","22-Bruck-Mürzzuschlag","Bruck-Mürzzuschlag",0,0,0,0,0,0,0,0,0,0,0,{"$f":"39+R74+R84","v":4558},4627,4729,4908,4967,5077,5099,5213,5290,5436,5493,5548,5609,5733]
["aktiveSteiermarkHartberg-Fürstenfeld",95,"aktive","Steiermark","23-Hartberg-Fürstenfeld","Hartberg-Fürstenfeld",0,0,0,0,0,0,0,0,0,0,0,{"$f":"46+R79+R77","v":5037},5132,5355,5485,5601,5916,6133,6310,6361,6674,6827,6839,6958,6983]
["aktiveSteiermarkSüdoststeiermark",96,"aktive","Steiermark","24-Südoststeiermark","Südoststeiermark",0,0,0,0,0,0,0,0,0,0,0,{"$f":"60+R76+R86","v":4159},4261,4412,4552,4717,4916,5010,5128,5168,5336,5439,5491,5511,5541]
[{"$error":"#N/A"},97,"aktive","Tirol","0 -im Bundesland gültig",{"$error":"#N/A"},47,54,49,160,92,44,42,47,47,21,8,9,10,6,15,7,6,6,9,12,8,7,4,7,1]
["aktiveTirolInnsbruck",98,"aktive","Tirol","1 -Innsbruck Stadt","Innsbruck",6168,6422,6535,6671,6737,6777,6969,7240,7376,7512,7739,7943,8144,8255,8364,8559,8694,8841,8919,8963,9267,9345,9381,9491,9581]
["aktiveTirolImst",99,"aktive","Tirol","2 -Pol.Bez. Imst","Imst",2299,2350,2419,2512,2579,2617,2683,2774,2838,2943,2995,3074,3199,3284,3353,3396,3498,3603,3687,3784,3930,4087,4146,4281,4336]
["aktiveTirolInnsbruck Land",100,"aktive","Tirol","3 -Innsbruck Land","Innsbruck Land",6235,6495,6645,6859,7062,7232,7464,7779,8009,8347,8452,8608,8927,9056,9362,9675,9894,9949,10198,10466,10871,11178,11555,11766,12032]
["aktiveTirolKitzbühel",101,"aktive","Tirol","4 -Pol.Bez. Kitzbühel","Kitzbühel",3486,3549,3762,3842,3910,4005,4129,4229,4315,4418,4525,4593,4709,4860,4972,5075,5193,5306,5406,5431,5622,5728,5851,5872,6015]
["aktiveTirolKufstein",102,"aktive","Tirol","5 -Pol.Bez. Kufstein","Kufstein",4139,4317,4480,4726,4781,4929,5107,5226,5317,5444,5612,5744,5834,5924,6064,6231,6390,6497,6708,7019,7267,7430,7455,7596,7803]
["aktiveTirolLandeck",103,"aktive","Tirol","6 -Pol.Bez. Landeck","Landeck",2106,2121,2193,2231,2274,2302,2350,2388,2420,2423,2473,2530,2627,2676,2723,2770,2827,2876,2926,2925,3041,3117,3241,3406,3460]
["aktiveTirolLienz",104,"aktive","Tirol","7 -Pol.Bez. Lienz","Lienz",1822,1839,1903,1983,2022,2087,2152,2207,2261,2314,2367,2447,2498,2615,2736,2867,2949,2958,3019,3093,3225,3264,3219,2994,3041]
["aktiveTirolReutte",105,"aktive","Tirol","8 -Pol.Bez. Reutte","Reutte",1480,1517,1539,1582,1604,1618,1669,1720,1772,1792,1837,1863,1900,1944,2005,2036,2100,2138,2181,2302,2423,2480,2572,2642,2698]
["aktiveTirolSchwaz",106,"aktive","Tirol","9 -Pol.Bez. Schwaz","Schwaz",3520,3592,3719,3808,3864,3902,4017,4079,4193,4267,4297,4399,4431,4546,4641,4798,4892,5014,5134,5230,5552,5674,5780,5883,5998]
[{"$error":"#N/A"},107,"aktive","Vorarlberg","0 -im Bundesland gültig",{"$error":"#N/A"},0,0,0,64,153,0,1,0,1,2,1,1,1,3,5,0,0,1,1,null,3,null,1,1,1]
["aktiveVorarlbergBludenz",108,"aktive","Vorarlberg","1 -Pol.Bez. Bludenz","Bludenz",2706,2750,2780,2845,2816,2834,2845,3018,3090,3209,3295,3395,3524,3593,3663,3743,3802,3859,3937,4004,4179,4248,4358,4448,4645]
["aktiveVorarlbergBregenz",109,"aktive","Vorarlberg","2 -Pol.Bez. Bregenz","Bregenz",5398,5503,5582,5715,5770,5879,5963,6262,6430,6574,6728,6900,7056,7340,7502,7617,7758,7975,8093,8264,8442,8578,8758,8807,9060]
["aktiveVorarlbergDornbirn",110,"aktive","Vorarlberg","3 -Pol.Bez. Dornbirn","Dornbirn",3796,3892,3965,4047,4052,4135,4126,4334,4406,4547,4734,4852,4877,5043,5184,5220,5304,5345,5502,5612,5882,5961,6058,6021,6110]
["aktiveVorarlbergFeldkirch",111,"aktive","Vorarlberg","4 -Pol.Bez. Feldkirch","Feldkirch",3859,3938,4007,4157,4172,4215,4275,4595,4738,4855,5026,5089,5272,5387,5515,5606,5677,5801,5884,6001,6195,6350,6436,6519,6579]
[{"$error":"#N/A"},112,"aktive","Wien","0 -im Bundesland gültig",{"$error":"#N/A"},108,101,108,348,320,72,46,47,37,43,41,23,21,23,28,27,28,283,null,null,null,null,null,1,1]
["aktiveWienInnere Stadt",113,"aktive","Wien","1 -I.     Bezirk","Innere Stadt",5774,5841,5878,6033,6118,6185,6374,6457,6583,6709,6921,7054,7271,7478,7639,7676,7934,8265,8565,8960,9310,9525,9674,9834,10086]
["aktiveWienLeopoldstadt",114,"aktive","Wien","2 -II.    Bezirk","Leopoldstadt",3950,4001,4085,4426,4709,4828,4985,5164,5354,5573,5611,5730,5874,5809,5903,6112,6217,6333,6540,6740,7004,7189,7357,7555,7861]
["aktiveWienLandstraße",115,"aktive","Wien","3 -III.   Bezirk","Landstraße",4781,4871,5005,5341,5587,5788,6084,6318,6478,6598,6717,6947,7192,7330,7544,7768,7858,7940,8091,8288,8513,8616,8735,9004,9301]
["aktiveWienWieden",116,"aktive","Wien","4 -IV.    Bezirk","Wieden",2614,2647,2711,2813,2869,2954,3027,3135,3261,3301,3346,3374,3408,3473,3530,3663,4210,4303,4330,4356,4410,4314,4306,4434,4565]
["aktiveWienMargareten",117,"aktive","Wien","5 -V.     Bezirk","Margareten",2513,2565,2642,2861,3042,3130,3208,3233,3335,3420,3431,3445,3538,3511,3557,3636,3632,3690,3743,3760,3840,3835,3855,3938,4009]
["aktiveWienMariahilf",118,"aktive","Wien","6 -VI.    Bezirk","Mariahilf",2847,2809,2930,3049,3061,3118,3183,3243,3349,3488,3532,3584,3658,3780,3826,3872,3851,3890,3964,4052,4090,4132,4122,4185,4248]
["aktiveWienNeubau",119,"aktive","Wien","7 -VII.   Bezirk","Neubau",3161,3250,3314,3430,3487,3602,3689,4278,4755,5135,5288,5499,5646,5747,5799,5601,5016,4800,4586,4599,4758,4791,4801,4867,4958]
["aktiveWienJosefstadt",120,"aktive","Wien","8 -VIII.  Bezirk","Josefstadt",1879,1876,1948,2032,2078,2134,2144,2209,2247,2313,2362,2417,2483,2533,2649,2750,2643,2670,2649,2671,2701,2725,2797,2797,2827]
["aktiveWienAlsergrund",121,"aktive","Wien","9 -IX.    Bezirk","Alsergrund",2917,2988,3042,3139,3252,3338,3352,3415,3501,3587,3560,3634,3738,3803,3923,4022,4038,4118,4171,4238,4313,4312,4334,4404,4467]
["aktiveWienFavoriten",122,"aktive","Wien","10-X.     Bezirk","Favoriten",4828,4895,4962,5424,5724,6046,6309,6511,6738,7088,7197,7243,7363,7222,7238,7383,7518,7792,7876,8046,8569,8910,8979,9249,9520]
["aktiveWienSimmering",123,"aktive","Wien","11-XI.    Bezirk","Simmering",2188,2289,2402,2572,2703,2766,2872,3055,3148,3301,3326,3340,3333,3261,3301,3392,3455,3548,3597,3629,3842,4048,4111,4214,4321]
["aktiveWienMeidling",124,"aktive","Wien","12-XII.   Bezirk","Meidling",3140,3201,3229,3486,3658,3841,3944,4230,4413,4423,4450,4493,4548,4558,4569,5061,5868,6204,6537,6573,6592,6439,6530,6632,6748]
["aktiveWienHietzing",125,"aktive","Wien","13-XIII.  Bezirk","Hietzing",2315,2380,2458,2545,2628,2680,2715,2842,2985,3034,3095,3218,3328,3433,3555,3673,3739,3797,3778,3768,3899,4015,4042,4025,4083]
["aktiveWienPenzing",126,"aktive","Wien","14-XIV.   Bezirk","Penzing",2977,3037,3134,3389,3547,3692,3763,3964,4153,4312,4298,4399,4471,4526,4604,4689,4725,4729,4835,4870,4959,5007,5121,5245,5440]
["aktiveWienRudolfsheim-Fünfhaus",127,"aktive","Wien","15-XV.    Bezirk","Rudolfsheim-Fünfhaus",3305,3372,3407,3640,3847,4007,4107,4200,4232,4515,4504,4603,4687,4570,4609,4570,4529,4575,4661,4667,4736,4747,4794,4848,4931]
["aktiveWienOttakring",128,"aktive","Wien","16-XVI.   Bezirk","Ottakring",3334,3396,3534,3863,4126,4318,4472,4762,5062,5228,5232,5369,5487,5437,5481,5439,4963,5032,5068,5069,5250,5284,5263,5271,5343]
["aktiveWienHernals",129,"aktive","Wien","17-XVII.  Bezirk","Hernals",2221,2253,2266,2566,2735,2797,2890,2953,2933,3030,2981,3030,3001,2941,2980,2952,2962,3063,3055,3089,3170,3126,3157,3233,3300]
["aktiveWienWähring",130,"aktive","Wien","18-XVIII. Bezirk","Währing",2364,2418,2481,2636,2704,2774,2823,2916,3000,3041,3109,3217,3260,3308,3269,3378,3460,3509,3609,3679,3851,3872,3954,4016,4029]
["aktiveWienDöbling",131,"aktive","Wien","19-XIX.   Bezirk","Döbling",3124,3170,3191,3308,3476,3656,3743,4083,4364,4604,4663,4769,4980,5039,5138,5149,5220,5284,5348,5419,5548,5596,5643,5707,5811]
[{"$f":"C132&D132&F132","v":"aktiveWienBrigittenau"},132,"aktive","Wien","20-XX.    Bezirk","Brigittenau",2469,2504,2627,2804,3051,3138,3184,3256,3371,3496,3452,3469,3532,3427,3462,3497,3517,3511,3546,3514,3654,3672,3716,3844,3883]
["aktiveWienFloridsdorf",133,"aktive","Wien","21-XXI.   Bezirk","Floridsdorf",3889,4056,4174,4382,4645,4797,4892,5050,5233,5308,5341,5413,5579,5531,5713,5922,6112,6168,6360,6534,6825,7026,7200,7404,7473]
["aktiveWienDonaustadt",134,"aktive","Wien","22-XXII.  Bezirk","Donaustadt",4061,4308,4608,5026,5204,5400,5632,5880,6074,6241,6485,6660,6846,7114,7309,7604,7943,8190,8507,8605,8756,9086,9459,9786,10236]
["aktiveWienLiesing",135,"aktive","Wien","23-XXIII. Bezirk","Liesing",4273,4283,4456,4667,4748,4895,5072,5275,5387,5494,5559,5716,5846,5943,6076,6299,6472,6718,6780,6925,7160,7393,7472,7622,7720]
[{"$error":"#N/A"},136,"ruhende","Burgenland","0 -im Bundesland gültig",{"$error":"#N/A"},0,1,0,10,2,4,2,7,6,7,10,9,9,10,2,4,11,10,10,17,17,14,6,7,8]
["ruhendeBurgenlandEisenstadt-Umgebung",137,"ruhende","Burgenland","1 -Eisenstadt-Umgebung","Eisenstadt-Umgebung",472,493,516,561,603,639,633,894,1045,1148,1258,1388,1460,1579,1673,1668,1638,1615,1503,1566,1466,1384,1256,1233,1242]
["ruhendeBurgenlandNeusiedl am See",138,"ruhende","Burgenland","2 -Neusiedl am See","Neusiedl am See",422,420,454,460,460,461,478,542,605,711,774,828,959,995,1179,1208,1223,1237,1132,1233,1134,1082,984,983,987]
["ruhendeBurgenlandMattersburg",139,"ruhende","Burgenland","3 -Mattersburg","Mattersburg",378,384,388,412,398,403,417,507,559,637,747,816,840,870,868,878,868,876,825,818,746,765,707,688,688]
["ruhendeBurgenlandOberpullendorf",140,"ruhende","Burgenland","4 -Oberpullendorf","Oberpullendorf",245,270,278,282,286,276,306,347,404,471,559,615,676,739,830,839,852,810,754,765,708,686,578,615,622]
["ruhendeBurgenlandOberwart",141,"ruhende","Burgenland","5 -Oberwart","Oberwart",373,401,431,444,472,484,468,529,600,683,758,839,938,1054,1113,1117,1092,1124,1108,1131,1052,1045,930,927,918]
["ruhendeBurgenlandGüssing",142,"ruhende","Burgenland","6 -Güssing","Güssing",136,152,184,204,237,249,238,290,341,384,439,527,564,613,653,643,579,520,493,517,446,407,383,379,404]
["ruhendeBurgenlandJennersdorf",143,"ruhende","Burgenland","7 -Jennersdorf","Jennersdorf",95,95,92,102,108,123,121,134,154,167,193,200,211,235,252,304,294,295,282,357,314,365,420,427,403]
[{"$error":"#N/A"},144,"ruhende","Kärnten","0 -im Bundesland gültig",{"$error":"#N/A"},0,0,0,10,0,0,0,0,0,0,1,1,1,1,0,0,0,0]
["ruhendeKärntenFeldkirchen",145,"ruhende","Kärnten","1 -Pol.Bez. Feldkirchen","Feldkirchen",264,269,300,334,328,306,304,321,319,335,362,433,494,406,415,438,469,408,409,425,379,409,391,413,402]
["ruhendeKärntenHermagor",146,"ruhende","Kärnten","2 -Pol.Bez. Hermagor","Hermagor",149,144,155,142,153,160,151,148,155,159,171,189,185,203,199,178,184,181,181,201,189,187,185,190,185]
["ruhendeKärntenKlagenfurt-Land",147,"ruhende","Kärnten","3 -Pol.Bez. Klagenfurt-Land","Klagenfurt-Land",653,648,703,697,682,652,677,695,713,776,780,831,833,901,961,967,988,948,947,940,910,875,866,854,890]
["ruhendeKärntenKlagenfurt am Wörthersee",148,"ruhende","Kärnten","4 -Statutarstadt Klagenfurt","Klagenfurt am Wörthersee",1159,1213,1270,1205,1207,1175,1159,1202,1246,1307,1296,1390,1465,1586,1675,1731,1705,1610,1584,1633,1582,1559,1527,1534,1546]
["ruhendeKärntenSankt Veit an der Glan",149,"ruhende","Kärnten","5 -Pol.Bez. Sankt Veit an der Glan","Sankt Veit an der Glan",515,552,571,558,553,518,502,503,531,559,624,659,706,726,765,778,865,853,802,793,729,696,687,692,703]
["ruhendeKärntenSpittal an der Drau",150,"ruhende","Kärnten","6 -Pol.Bez. Spittal an der Drau","Spittal an der Drau",836,849,912,902,853,838,832,830,858,937,923,958,1003,1047,1037,1000,1019,952,943,987,941,928,935,955,972]
["ruhendeKärntenVillach-Land",151,"ruhende","Kärnten","7 -Pol.Bez. Villach-Land","Villach-Land",584,606,629,640,623,610,596,628,635,658,662,679,716,756,786,778,797,762,773,771,738,724,747,764,793]
["ruhendeKärntenVillach",152,"ruhende","Kärnten","8 -Statutarstadt Villach","Villach",544,572,595,609,602,580,598,594,626,673,667,675,686,685,692,705,758,728,729,738,712,704,660,677,671]
["ruhendeKärntenVölkermarkt",153,"ruhende","Kärnten","9 -Pol.Bez. Völkermarkt","Völkermarkt",429,435,465,460,466,425,424,448,444,456,482,514,543,584,595,607,672,660,632,635,566,547,535,534,528]
["ruhendeKärntenWolfsberg",154,"ruhende","Kärnten","10-Pol.Bez. Wolfsberg","Wolfsberg",423,418,444,455,445,433,427,428,457,436,454,548,649,706,742,791,860,740,702,719,636,593,577,608,648]
[{"$error":"#N/A"},155,"ruhende","Niederösterreich","0 -im Bundesland gültig",{"$error":"#N/A"},0,0,0,5,0,0,0,0,2,1,3,2,0,0,0,0,0,0]
["ruhendeNiederösterreichAmstetten",156,"ruhende","Niederösterreich","1 -Amstetten","Amstetten",1079,1070,1123,1145,1136,1129,1117,1187,1255,1297,1391,1472,1533,1646,1704,1689,1713,1694,1726,1838,1759,1675,1538,1513,1513]
["ruhendeNiederösterreichBaden",157,"ruhende","Niederösterreich","2 -Baden","Baden",1989,2062,2160,2213,2269,2322,2343,2403,2504,2563,2631,2659,2753,2843,2865,2840,2855,2798,2769,2852,2845,2710,2494,2492,2414]
["ruhendeNiederösterreichBruck an der Leitha",158,"ruhende","Niederösterreich","3 -Bruck/Leitha","Bruck an der Leitha",372,389,404,417,435,474,486,510,529,553,611,659,668,767,824,803,1846,1878,1915,2031,2046,1989,1923,1890,1898]
["ruhendeNiederösterreichGänserndorf",159,"ruhende","Niederösterreich","4 -Gänserndorf","Gänserndorf",926,961,1023,1056,1137,1178,1221,1283,1375,1456,1522,1522,1576,1611,1628,1630,1688,1720,1716,1772,1769,1694,1547,1479,1512]
["ruhendeNiederösterreichGmünd",160,"ruhende","Niederösterreich","5 -Gmünd","Gmünd",490,508,526,536,554,534,543,558,562,587,592,626,633,670,701,716,707,657,623,669,675,627,567,555,554]
["ruhendeNiederösterreichHollabrunn",161,"ruhende","Niederösterreich","6 -Hollabrunn","Hollabrunn",482,469,481,478,486,470,486,489,516,559,601,648,651,692,740,758,815,747,722,759,725,672,598,590,589]
["ruhendeNiederösterreichHorn",162,"ruhende","Niederösterreich","7 -Horn","Horn",398,421,414,413,420,425,424,447,474,494,506,514,507,516,575,548,589,605,588,617,629,601,558,520,501]
["ruhendeNiederösterreichKorneuburg",163,"ruhende","Niederösterreich","8 -Korneuburg","Korneuburg",804,842,899,931,964,968,973,987,1056,1124,1166,1209,1253,1309,1396,1405,1624,1637,1613,1698,1710,1619,1488,1482,1489]
["ruhendeNiederösterreichKrems-Land",164,"ruhende","Niederösterreich","9 -Krems/Donau (Land)","Krems-Land",1014,1053,1043,1063,1048,1058,1070,1096,1172,1297,1384,1324,1382,1435,1404,1406,1435,1391,1415,1488,1435,1353,1235,1197,1147]
["ruhendeNiederösterreichLilienfeld",165,"ruhende","Niederösterreich","10-Lilienfeld","Lilienfeld",326,335,334,335,325,334,328,328,343,345,363,425,421,433,436,425,461,466,430,472,439,429,400,382,373]
["ruhendeNiederösterreichMelk",166,"ruhende","Niederösterreich","11-Melk","Melk",771,825,844,873,905,936,899,928,961,964,1013,1038,1126,1159,1250,1352,1446,1432,1417,1578,1516,1402,1218,1179,1143]
["ruhendeNiederösterreichMistelbach",167,"ruhende","Niederösterreich","12-Mistelbach","Mistelbach",613,665,705,696,717,751,766,794,819,880,953,1040,1055,1078,1185,1200,1251,1243,1298,1376,1372,1225,1193,1178,1166]
["ruhendeNiederösterreichMödling",168,"ruhende","Niederösterreich","13-Mödling","Mödling",2020,2132,2207,2326,2333,2332,2325,2339,2367,2487,2570,2636,2713,2708,2785,2729,2737,2725,2706,2834,2807,2657,2435,2350,2321]
["ruhendeNiederösterreichNeunkirchen",169,"ruhende","Niederösterreich","14-Neunkirchen","Neunkirchen",1048,1064,1123,1120,1131,1161,1169,1186,1244,1253,1293,1371,1412,1455,1478,1538,1585,1586,1571,1620,1591,1506,1411,1388,1376]
["ruhendeNiederösterreichSankt Pölten-Land",170,"ruhende","Niederösterreich","15-Sankt Pölten (Land)","Sankt Pölten-Land",1888,1983,2077,2163,2167,2160,2134,2160,2220,2271,2335,2533,2640,2806,2895,2900,3469,3427,3404,3599,3592,3444,3263,3275,3234]
["ruhendeNiederösterreichScheibbs",171,"ruhende","Niederösterreich","16-Scheibbs","Scheibbs",343,369,397,415,433,422,441,439,435,429,459,486,487,510,540,536,553,542,556,612,623,624,554,553,590]
["ruhendeNiederösterreichTulln",172,"ruhende","Niederösterreich","17-Tulln","Tulln",750,767,796,806,859,879,855,901,964,1062,1088,1175,1221,1239,1300,1339,1894,1908,1965,2000,2016,1932,1810,1811,1793]
["ruhendeNiederösterreichWaidhofen an der Thaya",173,"ruhende","Niederösterreich","18-Waidhofen/Thaya","Waidhofen an der Thaya",297,293,324,319,322,316,317,306,304,322,344,355,354,363,384,388,388,365,332,337,383,356,332,352,351]
["ruhendeNiederösterreichWiener Neustadt-Land",174,"ruhende","Niederösterreich","19-Wiener Neustadt (Land)","Wiener Neustadt-Land",1437,1504,1591,1630,1648,1675,1729,1811,1906,2013,2105,2255,2296,2438,2505,2541,2612,2596,2507,2665,2633,2512,2376,2334,2318]
["ruhendeNiederösterreichWien-Umgebung",175,"ruhende","Niederösterreich","20-Wien-Umgebung","Wien-Umgebung",1475,1558,1642,1706,1756,1834,1804,1884,1975,2024,2166,2299,2315,2365,2358,2338,0,0]
["ruhendeNiederösterreichZwettl",176,"ruhende","Niederösterreich","21-Zwettl","Zwettl",473,490,498,479,472,474,481,474,501,517,501,539,551,560,595,607,638,650,630,624,636,600,549,538,504]
[{"$error":"#N/A"},177,"ruhende","Niederösterreich","99-im Bundesland gültig",{"$error":"#N/A"},14,14,17,15,18,19,14,17,24,26,20,17,20,20,20,20,20,18,18,19,17,20,20,20,21]
[{"$error":"#N/A"},178,"ruhende","Oberösterreich","0 -im Bundesland gültig",{"$error":"#N/A"},0,0,0,4,6,0,0,0,0,0,0,0,0,0,0,0,0,0]
["ruhendeOberösterreichLinz",179,"ruhende","Oberösterreich","1 -Statutarstadt Linz/Donau","Linz",2634,2694,2776,2811,2770,2730,2802,2820,2946,3029,3083,3157,3212,3245,3275,3316,3325,3302,3315,3449,3428,3237,3085,3006,3054]
["ruhendeOberösterreichSteyr",180,"ruhende","Oberösterreich","2 -Statutarstadt Steyr","Steyr",450,498,494,470,455,449,433,472,469,457,479,499,494,511,502,499,510,505,496,507,494,481,468,436,423]
["ruhendeOberösterreichWels",181,"ruhende","Oberösterreich","3 -Statutarstadt Wels","Wels",692,720,735,717,693,672,676,672,712,713,697,742,779,761,811,869,836,811,839,853,829,812,817,797,790]
["ruhendeOberösterreichBraunau am Inn",182,"ruhende","Oberösterreich","4 -Pol.Bez. Braunau am Inn","Braunau am Inn",775,810,824,824,826,819,801,830,856,926,926,992,1068,1070,1093,1132,1171,1179,1176,1202,1193,1183,1084,1074,1024]
["ruhendeOberösterreichEferding",183,"ruhende","Oberösterreich","5 -Pol.Bez. Eferding","Eferding",316,316,335,359,373,365,349,354,364,367,375,401,386,375,391,396,404,421,437,460,460,440,411,431,419]
["ruhendeOberösterreichFreistadt",184,"ruhende","Oberösterreich","6 -Pol.Bez. Freistadt","Freistadt",414,419,421,424,443,424,425,464,512,525,543,561,581,616,622,636,658,651,673,688,724,720,691,674,712]
["ruhendeOberösterreichGmunden",185,"ruhende","Oberösterreich","7 -Pol.Bez. Gmunden","Gmunden",1164,1197,1216,1212,1231,1184,1207,1163,1187,1194,1241,1297,1285,1302,1387,1424,1374,1410,1391,1458,1441,1418,1356,1345,1310]
["ruhendeOberösterreichGrieskirchen",186,"ruhende","Oberösterreich","8 -Pol.Bez. Grieskirchen","Grieskirchen",474,484,504,493,480,487,487,496,503,518,537,537,565,593,594,601,643,629,642,708,718,684,647,660,674]
["ruhendeOberösterreichKirchdorf an der Krems",187,"ruhende","Oberösterreich","9 -Pol.Bez. Kirchdorf an der Krems","Kirchdorf an der Krems",509,520,491,465,484,485,498,508,525,555,563,583,598,640,636,656,638,640,669,684,696,672,629,642,643]
["ruhendeOberösterreichLinz-Land",188,"ruhende","Oberösterreich","10-Pol.Bez. Linz-Land","Linz-Land",1532,1602,1670,1707,1665,1676,1726,1805,1896,1938,1925,1957,2039,2158,2280,2250,2256,2215,2240,2327,2288,2183,2123,2162,2164]
["ruhendeOberösterreichPerg",189,"ruhende","Oberösterreich","11-Pol.Bez. Perg","Perg",414,433,474,490,507,494,497,520,525,528,564,557,597,605,638,688,677,678,669,717,729,722,739,724,698]
["ruhendeOberösterreichRied im Innkreis",190,"ruhende","Oberösterreich","12-Pol.Bez. Ried im Innkreis","Ried im Innkreis",461,503,511,541,544,536,525,521,537,563,527,521,536,529,543,549,531,540,543,582,591,581,576,572,593]
["ruhendeOberösterreichRohrbach",191,"ruhende","Oberösterreich","13-Pol.Bez. Rohrbach","Rohrbach",306,299,305,334,333,323,332,341,355,363,377,395,430,434,461,468,473,479,511,526,533,517,491,498,500]
["ruhendeOberösterreichSchärding",192,"ruhende","Oberösterreich","14-Pol.Bez. Schärding","Schärding",321,338,345,345,338,350,345,364,357,357,378,402,392,404,437,443,459,456,433,459,468,452,437,430,458]
["ruhendeOberösterreichSteyr-Land",193,"ruhende","Oberösterreich","15-Pol.Bez. Steyr-Land","Steyr-Land",461,479,482,475,496,519,522,549,565,602,621,622,654,653,651,689,725,692,703,728,736,743,715,706,699]
["ruhendeOberösterreichUrfahr-Umgebung",194,"ruhende","Oberösterreich","16-Pol.Bez. Urfahr-Umgebung","Urfahr-Umgebung",684,727,747,763,782,775,770,833,882,905,929,964,1020,1044,1082,1096,1137,1182,1202,1265,1253,1224,1166,1157,1151]
["ruhendeOberösterreichVöcklabruck",195,"ruhende","Oberösterreich","17-Pol.Bez. Vöcklabruck","Vöcklabruck",1261,1312,1340,1374,1419,1346,1364,1377,1419,1425,1468,1589,1599,1626,1608,1651,1738,1702,1724,1822,1825,1750,1651,1667,1681]
[{"$f":"C196&D196&F196","v":"ruhendeOberösterreichWels-Land"},196,"ruhende","Oberösterreich","18-Pol.Bez. Wels-Land","Wels-Land",634,683,693,675,678,675,722,697,748,757,773,788,860,874,878,875,885,881,887,925,931,868,901,905,893]
[{"$error":"#N/A"},197,"ruhende","Salzburg","0 -im Bundesland gültig",{"$error":"#N/A"},0,0,0,1,0,0,0,0,0,0,0,0,0,0,0,0,1,3,6,7,8,8,7,4,5]
["ruhendeSalzburgSalzburg",198,"ruhende","Salzburg","1 -Stadt Salzburg","Salzburg",2820,2966,2922,2868,2949,2953,2846,2855,2894,2911,2990,2906,2982,3006,2970,2883,2850,2856,2843,2967,2786,2685,2677,2699,2679]
["ruhendeSalzburgHallein",199,"ruhende","Salzburg","2 -Pol.Bez. Hallein","Hallein",748,744,727,736,758,737,716,717,731,768,824,880,866,868,881,825,796,802,788,834,805,778,766,737,733]
["ruhendeSalzburgSalzburg-Umgebung",200,"ruhende","Salzburg","3 -Pol.Bez. Salzburg-Umgebung","Salzburg-Umgebung",2011,2144,2223,2209,2217,2194,2159,2150,2184,2190,2238,2268,2352,2436,2498,2493,2536,2460,2394,2422,2286,2265,2195,2160,2155]
["ruhendeSalzburgSankt Johann im Pongau",201,"ruhende","Salzburg","4 -Pol.Bez. Sankt Johann im Pongau","Sankt Johann im Pongau",895,933,985,956,980,955,947,933,946,956,989,1037,1030,1030,1051,1028,979,977,932,1015,894,868,835,805,812]
["ruhendeSalzburgTamsweg",202,"ruhende","Salzburg","5 -Pol.Bez. Tamsweg","Tamsweg",194,223,232,209,217,207,209,213,194,198,191,192,202,197,202,205,211,205,203,216,196,215,200,199,195]
["ruhendeSalzburgZell am See",203,"ruhende","Salzburg","6 -Pol.Bez. Zell am See","Zell am See",1022,1062,1083,1093,1081,1097,1093,1109,1128,1087,1080,1051,1118,1135,1156,1170,1157,1126,1077,1185,1112,1082,1037,1013,1067]
[{"$error":"#N/A"},204,"ruhende","Salzburg","10-unbekannt",{"$error":"#N/A"},0,0,0,0,0,0,0,0,0,0,0,0,0,0,0,0,0,0]
[{"$error":"#N/A"},205,"ruhende","Steiermark","0 -im Bundesland gültig",{"$error":"#N/A"},0,0,2,36,0,0,0,0,0,0,0,0,0,0,0,0,0,0]
["ruhendeSteiermarkGraz",206,"ruhende","Steiermark","1 -Graz-Stadt","Graz",3246,3490,3681,3760,3744,3716,3784,3844,3917,4039,4091,4215,4339,4420,4530,4547,4586,4444,4340,4471,4400,4277,4120,4092,4177]
["ruhendeSteiermarkBruck an der Mur",207,"ruhende","Steiermark","2 -Bruck an der Mur","Bruck an der Mur",542,556,526,516,544,529,524,526,551,558,532,601,0,0,0,0,0,0]
["ruhendeSteiermarkDeutschlandsberg",208,"ruhende","Steiermark","3 -Deutschlandsberg","Deutschlandsberg",489,516,551,539,550,564,579,607,593,606,595,653,709,769,771,763,792,782,757,806,787,756,711,727,689]
["ruhendeSteiermarkFeldbach",209,"ruhende","Steiermark","4 -Feldbach","Feldbach",484,505,523,539,549,544,548,554,566,604,640,723,0,0,0,0,0,0]
["ruhendeSteiermarkFürstenfeld",210,"ruhende","Steiermark","5 -Fürstenfeld","Fürstenfeld",199,210,207,217,223,218,223,242,232,251,247,253,0,0,0,0,0,0]
["ruhendeSteiermarkGraz-Umgebung",211,"ruhende","Steiermark","6 -Graz-Umgebung","Graz-Umgebung",1284,1379,1437,1502,1521,1510,1502,1543,1644,1701,1757,1833,1966,2043,2111,2211,2357,2367,2416,2487,2496,2369,2298,2288,2268]
["ruhendeSteiermarkHartberg",212,"ruhende","Steiermark","7 -Hartberg","Hartberg",438,465,475,512,525,509,511,537,546,574,647,656,0,0,0,0,0,0]
["ruhendeSteiermarkJudenburg",213,"ruhende","Steiermark","8 -Judenburg","Judenburg",375,389,392,418,411,389,397,379,384,384,407,0,0,0,0,0,0,0]
["ruhendeSteiermarkLeibnitz",214,"ruhende","Steiermark","9 -Leibnitz","Leibnitz",559,597,655,661,679,680,666,727,769,787,827,861,885,918,929,942,976,980,981,1053,1049,1030,970,971,1001]
["ruhendeSteiermarkLeoben",215,"ruhende","Steiermark","10-Leoben","Leoben",497,524,554,564,560,556,523,555,581,602,701,791,792,784,770,732,726,716,684,779,713,646,623,636,629]
["ruhendeSteiermarkLiezen",216,"ruhende","Steiermark","11-Liezen","Liezen",422,420,436,449,425,426,420,430,424,445,504,727,732,788,775,768,758,719,691,718,700,638,577,567,564]
["ruhendeSteiermarkMürzzuschlag",217,"ruhende","Steiermark","12-Mürzzuschlag","Mürzzuschlag",257,286,300,309,291,299,285,289,290,320,303,308,0,0,0,0,0,0]
["ruhendeSteiermarkMurau",218,"ruhende","Steiermark","13-Murau","Murau",215,235,245,269,265,258,252,244,250,259,268,268,282,282,300,307,308,328,325,351,332,306,333,336,315]
["ruhendeSteiermarkRadkersburg",219,"ruhende","Steiermark","14-Radkersburg","Radkersburg",174,202,188,193,213,212,216,200,191,183,205,205,0,0,0,0,0,0]
["ruhendeSteiermarkGröbming",220,"ruhende","Steiermark","15-Gröbming","Gröbming",303,310,333,334,348,325,328,333,334,330,323,319,339,363,360,349,347,316,320,327,307,272,261,247,250]
["ruhendeSteiermarkVoitsberg",221,"ruhende","Steiermark","16-Voitsberg","Voitsberg",415,444,460,499,518,529,517,530,556,576,603,616,657,671,663,657,690,717,748,766,785,756,707,743,757]
["ruhendeSteiermarkWeiz",222,"ruhende","Steiermark","17-Weiz","Weiz",583,633,683,694,730,709,714,737,769,782,835,859,945,947,987,1003,1044,1083,1138,1269,1311,1352,1395,1433,1465]
["ruhendeSteiermarkBad Aussee",223,"ruhende","Steiermark","18-Bad Aussee","Bad Aussee",141,152,150,147,147,145,152,141,151,157,162,0,0,0,0,0,0,0]
["ruhendeSteiermarkKnittelfeld",224,"ruhende","Steiermark","19-Knittelfeld","Knittelfeld",185,186,193,211,213,213,214,212,218,215,212,0,0,0,0,0,0,0]
["ruhendeSteiermarkMariazell",225,"ruhende","Steiermark","20-Mariazell","Mariazell",67,71,70,63,73,66,61,60,64,59,53,0,0,0,0,0,0,0]
["ruhendeSteiermarkMurtal",226,"ruhende","Steiermark","21-Murtal","Murtal",0,0,0,0,0,0,0,0,0,0,{"$f":"4+Q213+Q224","v":623},673,781,887,1004,1041,1206,1234,1288,1389,1150,1018,980,1124,1092]
["ruhendeSteiermarkBruck-Mürzzuschlag",227,"ruhende","Steiermark","22-Bruck-Mürzzuschlag","Bruck-Mürzzuschlag",0,0,0,0,0,0,0,0,0,0,0,{"$f":"4+R207+R217","v":913},955,974,988,990,1007,981,942,1043,982,1001,954,942,947]
["ruhendeSteiermarkHartberg-Fürstenfeld",228,"ruhende","Steiermark","23-Hartberg-Fürstenfeld","Hartberg-Fürstenfeld",0,0,0,0,0,0,0,0,0,0,0,{"$f":"11+R212+R210","v":920},1033,1115,1123,1185,1209,1197,1186,1282,1245,1213,1251,1237,1158]
["ruhendeSteiermarkSüdoststeiermark",229,"ruhende","Steiermark","24-Südoststeiermark","Südoststeiermark",0,0,0,0,0,0,0,0,0,0,0,{"$f":"5+R209+R219","v":933},977,932,956,965,955,989,961,955,922,907,888,886,924]
[{"$error":"#N/A"},230,"ruhende","Tirol","0 -im Bundesland gültig",{"$error":"#N/A"},3,4,4,7,9,3,3,3,3,4,2,2,2,4,4,3,3,3,3,4,3,3,1]
["ruhendeTirolInnsbruck",231,"ruhende","Tirol","1 -Innsbruck Stadt","Innsbruck",1614,1669,1772,1760,1774,1771,1764,1779,1800,1765,1727,1806,1840,1853,1840,1813,1785,1734,1712,1679,1627,1587,1587,1588,1608]
["ruhendeTirolImst",232,"ruhende","Tirol","2 -Pol.Bez. Imst","Imst",545,572,594,576,598,577,541,544,575,586,600,601,610,638,657,670,658,626,610,594,588,569,551,522,532]
["ruhendeTirolInnsbruck Land",233,"ruhende","Tirol","3 -Innsbruck Land","Innsbruck Land",1775,1790,1875,1855,1840,1859,1899,1935,2000,2031,2100,2149,2249,2155,2147,2177,2207,2110,2100,2079,2039,1954,1950,1988,1980]
["ruhendeTirolKitzbühel",234,"ruhende","Tirol","4 -Pol.Bez. Kitzbühel","Kitzbühel",808,807,791,776,780,791,752,754,775,765,758,771,783,800,808,832,815,769,773,791,735,693,673,729,717]
["ruhendeTirolKufstein",235,"ruhende","Tirol","5 -Pol.Bez. Kufstein","Kufstein",918,923,943,922,929,943,935,959,972,976,995,990,996,1009,999,1032,1008,976,990,975,966,900,911,926,937]
["ruhendeTirolLandeck",236,"ruhende","Tirol","6 -Pol.Bez. Landeck","Landeck",456,468,467,466,465,457,475,471,489,494,489,491,497,491,498,510,498,463,470,522,438,422,420,424,445]
["ruhendeTirolLienz",237,"ruhende","Tirol","7 -Pol.Bez. Lienz","Lienz",404,434,441,423,416,411,407,404,406,412,393,389,430,439,445,485,524,533,504,547,519,476,489,437,392]
["ruhendeTirolReutte",238,"ruhende","Tirol","8 -Pol.Bez. Reutte","Reutte",329,334,329,314,302,314,308,305,330,343,336,365,373,373,372,371,389,385,368,366,364,348,351,377,364]
["ruhendeTirolSchwaz",239,"ruhende","Tirol","9 -Pol.Bez. Schwaz","Schwaz",794,798,796,786,763,765,720,744,735,734,745,759,799,819,791,821,822,778,754,733,706,674,684,694,704]
[{"$error":"#N/A"},240,"ruhende","Vorarlberg","0 -im Bundesland gültig",{"$error":"#N/A"},0,0,0,7,15,0,1,0,1,3,0,0,0,2,0,0,0,0,null,null,1]
["ruhendeVorarlbergBludenz",241,"ruhende","Vorarlberg","1 -Pol.Bez. Bludenz","Bludenz",620,651,657,667,678,652,643,636,639,624,639,637,650,652,701,679,683,669,671,681,633,637,626,605,614]
["ruhendeVorarlbergBregenz",242,"ruhende","Vorarlberg","2 -Pol.Bez. Bregenz","Bregenz",1319,1367,1396,1408,1390,1330,1296,1295,1285,1285,1283,1263,1273,1298,1306,1311,1351,1306,1351,1416,1397,1366,1339,1394,1385]
["ruhendeVorarlbergDornbirn",243,"ruhende","Vorarlberg","3 -Pol.Bez. Dornbirn","Dornbirn",946,958,1001,1017,1011,951,961,977,1001,1006,993,1027,1034,1002,1013,964,1001,1012,1008,979,953,931,902,936,910]
["ruhendeVorarlbergFeldkirch",244,"ruhende","Vorarlberg","4 -Pol.Bez. Feldkirch","Feldkirch",1051,1086,1122,1155,1161,1121,1062,1071,1109,1060,1053,1102,1133,1082,1090,1071,1092,1070,1061,1105,1053,1014,1012,1014,1006]
[{"$error":"#N/A"},245,"ruhende","Wien","0 -im Bundesland gültig",{"$error":"#N/A"},26,28,31,41,35,8,7,8,6,6,8,10,9,10,8,9,11,164]
["ruhendeWienInnere Stadt",246,"ruhende","Wien","1 -I.     Bezirk","Innere Stadt",1079,1085,1110,1087,1079,1065,1062,1059,1032,1057,1005,972,986,1042,1033,1027,997,959,966,1020,996,1004,996,1002,937]
["ruhendeWienLeopoldstadt",247,"ruhende","Wien","2 -II.    Bezirk","Leopoldstadt",1332,1366,1385,1369,1398,1469,1545,1596,1576,1615,1644,1683,1725,1747,1773,1740,1716,1649,1585,1623,1551,1548,1497,1505,1512]
["ruhendeWienLandstraße",248,"ruhende","Wien","3 -III.   Bezirk","Landstraße",1451,1503,1535,1560,1574,1597,1662,1712,1719,1750,1737,1769,1811,1828,1887,1878,1811,1773,1721,1747,1703,1643,1637,1587,1548]
["ruhendeWienWieden",249,"ruhende","Wien","4 -IV.    Bezirk","Wieden",773,767,777,790,760,763,758,784,786,818,840,848,829,849,857,878,891,855,860,884,841,798,779,757,774]
["ruhendeWienMargareten",250,"ruhende","Wien","5 -V.     Bezirk","Margareten",898,912,943,927,931,962,966,978,998,1045,1045,1048,1064,1096,1106,1038,1010,964,927,983,930,909,866,814,827]
["ruhendeWienMariahilf",251,"ruhende","Wien","6 -VI.    Bezirk","Mariahilf",743,781,800,796,794,798,787,785,794,784,796,813,833,845,869,871,852,841,814,831,754,728,686,688,707]
["ruhendeWienNeubau",252,"ruhende","Wien","7 -VII.   Bezirk","Neubau",814,832,852,864,865,897,889,928,976,1000,1013,1032,1110,1142,1177,1176,1137,1107,1045,1027,955,912,839,848,838]
["ruhendeWienJosefstadt",253,"ruhende","Wien","8 -VIII.  Bezirk","Josefstadt",600,609,610,600,622,615,611,592,613,618,633,648,647,659,672,686,695,692,666,681,639,609,576,580,578]
["ruhendeWienAlsergrund",254,"ruhende","Wien","9 -IX.    Bezirk","Alsergrund",920,932,959,978,975,977,971,973,943,971,981,961,964,949,986,993,979,941,954,949,918,890,863,809,829]
["ruhendeWienFavoriten",255,"ruhende","Wien","10-X.     Bezirk","Favoriten",1674,1743,1781,1800,1850,1892,1971,2000,2045,2084,2117,2207,2202,2267,2266,2283,2249,2270,2413,2522,2424,2401,2183,2192,2127]
["ruhendeWienSimmering",256,"ruhende","Wien","11-XI.    Bezirk","Simmering",772,787,789,795,799,818,830,847,873,890,933,959,956,959,942,927,930,906,891,969,904,916,876,860,893]
["ruhendeWienMeidling",257,"ruhende","Wien","12-XII.   Bezirk","Meidling",1048,1080,1087,1098,1123,1141,1163,1185,1182,1239,1260,1284,1297,1280,1325,1358,1370,1385,1451,1572,1548,1543,1456,1465,1442]
["ruhendeWienHietzing",258,"ruhende","Wien","13-XIII.  Bezirk","Hietzing",778,812,807,839,830,829,816,854,903,937,938,943,976,1009,1042,1040,1052,1083,1084,1091,1062,1031,980,1014,983]
["ruhendeWienPenzing",259,"ruhende","Wien","14-XIV.   Bezirk","Penzing",1035,1040,1048,1071,1098,1122,1175,1173,1187,1217,1239,1309,1313,1362,1401,1378,1372,1372,1351,1389,1295,1279,1247,1253,1237]
[{"$f":"C260&D260&F260","v":"ruhendeWienRudolfsheim-Fünfhaus"},260,"ruhende","Wien","15-XV.    Bezirk","Rudolfsheim-Fünfhaus",980,981,1021,1051,1069,1067,1083,1084,1111,1120,1166,1170,1198,1225,1239,1254,1259,1226,1171,1218,1113,1079,1033,997,1005]
["ruhendeWienOttakring",261,"ruhende","Wien","16-XVI.   Bezirk","Ottakring",1119,1144,1184,1179,1227,1268,1281,1308,1353,1378,1423,1449,1466,1498,1547,1567,1519,1463,1397,1452,1387,1327,1251,1197,1210]
["ruhendeWienHernals",262,"ruhende","Wien","17-XVII.  Bezirk","Hernals",742,775,808,794,817,843,868,869,892,900,918,957,973,984,1013,1008,984,967,926,929,877,842,762,743,753]
["ruhendeWienWähring",263,"ruhende","Wien","18-XVIII. Bezirk","Währing",782,805,827,859,871,895,909,934,918,960,964,994,986,986,1024,1006,1014,943,966,1005,971,946,904,904,928]
["ruhendeWienDöbling",264,"ruhende","Wien","19-XIX.   Bezirk","Döbling",1071,1097,1131,1157,1173,1160,1142,1138,1210,1284,1285,1345,1419,1457,1492,1473,1456,1425,1390,1433,1400,1339,1296,1280,1269]
["ruhendeWienBrigittenau",265,"ruhende","Wien","20-XX.    Bezirk","Brigittenau",806,836,877,913,926,992,1019,1047,1038,1071,1096,1143,1171,1194,1169,1171,1132,1092,1065,1128,1066,1013,956,947,934]
["ruhendeWienFloridsdorf",266,"ruhende","Wien","21-XXI.   Bezirk","Floridsdorf",1432,1467,1496,1546,1581,1615,1627,1643,1686,1729,1769,1828,1832,1867,1923,1925,1888,1800,1813,1895,1804,1786,1730,1767,1818]
["ruhendeWienDonaustadt",267,"ruhende","Wien","22-XXII.  Bezirk","Donaustadt",1510,1544,1604,1695,1703,1728,1764,1798,1858,1917,1927,1981,2033,2075,2161,2184,2178,2214,2220,2280,2255,2195,2127,2155,2203]
["ruhendeWienLiesing",268,"ruhende","Wien","23-XXIII. Bezirk","Liesing",1262,1292,1333,1352,1342,1353,1353,1369,1398,1451,1488,1480,1495,1513,1581,1568,1563,1535,1534,1605,1536,1472,1436,1481,1460]
[{"$error":"#N/A"},269,"gesamte","Burgenland","0 -im Bundesland gültig",{"$error":"#N/A"},{"$f":"G136+G3","v":0},{"$f":"H136+H3","v":3},6,100,15,20,36,50,44,45,53,44,48,54,16,26,{"$f":"W136+W3","v":62},{"$f":"X136+X3","v":59},60,{"$f":"Z136+Z3","v":60},59,{"$f":"AB136+AB3","v":64},60,{"$f":"AD136+AD3","v":63},64]
["gesamteBurgenlandEisenstadt-Umgebung",270,"gesamte","Burgenland","1 -Eisenstadt-Umgebung","Eisenstadt-Umgebung",{"$f":"G137+G4","v":2713},2837,2958,3150,3306,3384,3451,4010,4331,4669,4885,5065,5261,5449,5680,{"$f":"V137+V4","v":5722},5733,{"$f":"X137+X4","v":5796},5792,{"$f":"Z137+Z4","v":5877},5964,{"$f":"AB137+AB4","v":5890},5798,{"$f":"AD137+AD4","v":5851},5955]
["gesamteBurgenlandNeusiedl am See",271,"gesamte","Burgenland","2 -Neusiedl am See","Neusiedl am See",2325,2433,2569,2663,2764,2791,2925,3174,3373,3687,3906,4201,4452,4633,4920,{"$f":"V138+V5","v":5176},5258,{"$f":"X138+X5","v":5447},5378,{"$f":"Z138+Z5","v":5565},5549,{"$f":"AB138+AB5","v":5675},5638,{"$f":"AD138+AD5","v":5668},5705]
["gesamteBurgenlandMattersburg",272,"gesamte","Burgenland","3 -Mattersburg","Mattersburg",1764,1803,1847,1906,1977,2050,2119,2325,2478,2663,2772,2884,2956,3089,3118,{"$f":"V139+V6","v":3200},3220,{"$f":"X139+X6","v":3289},3260,{"$f":"Z139+Z6","v":3305},3300,{"$f":"AB139+AB6","v":3363},3307,{"$f":"AD139+AD6","v":3350},3439]
["gesamteBurgenlandOberpullendorf",273,"gesamte","Burgenland","4 -Oberpullendorf","Oberpullendorf",1618,1610,1680,1752,1784,1850,1886,2082,2198,2365,2570,2676,2743,2921,3060,{"$f":"V140+V7","v":3156},3149,{"$f":"X140+X7","v":3165},3153,{"$f":"Z140+Z7","v":3251},3244,{"$f":"AB140+AB7","v":3312},3247,{"$f":"AD140+AD7","v":3307},3407]
["gesamteBurgenlandOberwart",274,"gesamte","Burgenland","5 -Oberwart","Oberwart",2299,2399,2503,2575,2696,2780,2840,3140,3328,3584,3850,4050,4191,4337,4456,{"$f":"V141+V8","v":4485},4531,{"$f":"X141+X8","v":4684},4786,{"$f":"Z141+Z8","v":4903},4868,{"$f":"AB141+AB8","v":4890},4922,{"$f":"AD141+AD8","v":4921},4860]
["gesamteBurgenlandGüssing",275,"gesamte","Burgenland","6 -Güssing","Güssing",979,1057,1133,1229,1294,1346,1379,1513,1620,1755,1848,2039,2154,2321,2485,{"$f":"V142+V9","v":2526},2481,{"$f":"X142+X9","v":2437},2418,{"$f":"Z142+Z9","v":2407},2322,{"$f":"AB142+AB9","v":2223},2181,{"$f":"AD142+AD9","v":2156},2200]
["gesamteBurgenlandJennersdorf",276,"gesamte","Burgenland","7 -Jennersdorf","Jennersdorf",652,675,701,707,730,776,818,877,925,988,1054,1091,1110,1174,1327,{"$f":"V143+V10","v":1484},1550,{"$f":"X143+X10","v":1571},1610,{"$f":"Z143+Z10","v":1692},1713,{"$f":"AB143+AB10","v":1872},1934,{"$f":"AD143+AD10","v":2036},2066]
[{"$error":"#N/A"},277,"gesamte","Kärnten","0 -im Bundesland gültig",{"$error":"#N/A"},0,0,8,86,0,0,0,0,0,1,1,1,2,3,0,{"$f":"V144+V11","v":0},0,{"$f":"X144+X11","v":0},0,{"$f":"Z144+Z11","v":0},1,{"$f":"AB144+AB11","v":0},0,{"$f":"AD144+AD11","v":0},0]
["gesamteKärntenFeldkirchen",278,"gesamte","Kärnten","1 -Pol.Bez. Feldkirchen","Feldkirchen",1438,1466,1520,1575,1618,1671,1706,1769,1775,1817,1927,2007,2140,2232,2310,{"$f":"V145+V12","v":2386},2378,{"$f":"X145+X12","v":2384},2424,{"$f":"Z145+Z12","v":2466},2485,{"$f":"AB145+AB12","v":2532},2546,{"$f":"AD145+AD12","v":2596},2634]
["gesamteKärntenHermagor",279,"gesamte","Kärnten","2 -Pol.Bez. Hermagor","Hermagor",921,937,950,958,990,1007,1044,1062,1078,1117,1131,1163,1194,1253,1264,{"$f":"V146+V13","v":1262},1317,{"$f":"X146+X13","v":1331},1353,{"$f":"Z146+Z13","v":1386},1397,{"$f":"AB146+AB13","v":1452},1493,{"$f":"AD146+AD13","v":1547},1625]
["gesamteKärntenKlagenfurt-Land",280,"gesamte","Kärnten","3 -Pol.Bez. Klagenfurt-Land","Klagenfurt-Land",2785,2857,2976,3016,3087,3133,3185,3280,3386,3478,3597,3776,3917,4125,4273,{"$f":"V147+V14","v":4367},4430,{"$f":"X147+X14","v":4478},4602,{"$f":"Z147+Z14","v":4747},4830,{"$f":"AB147+AB14","v":4850},4908,{"$f":"AD147+AD14","v":4988},5125]
["gesamteKärntenKlagenfurt am Wörthersee",281,"gesamte","Kärnten","4 -Statutarstadt Klagenfurt","Klagenfurt am Wörthersee",6196,6353,6542,6627,6741,6857,6983,7151,7365,7461,7550,7866,8195,8568,8712,{"$f":"V148+V15","v":8880},9014,{"$f":"X148+X15","v":9127},9250,{"$f":"Z148+Z15","v":9558},9721,{"$f":"AB148+AB15","v":9834},9915,{"$f":"AD148+AD15","v":10039},10180]
["gesamteKärntenSankt Veit an der Glan",282,"gesamte","Kärnten","5 -Pol.Bez. Sankt Veit an der Glan","Sankt Veit an der Glan",2461,2582,2615,2626,2667,2682,2736,2812,2895,2995,3197,3286,3447,3617,3764,{"$f":"V149+V16","v":3910},4087,{"$f":"X149+X16","v":4117},4074,{"$f":"Z149+Z16","v":4065},4061,{"$f":"AB149+AB16","v":4024},4123,{"$f":"AD149+AD16","v":4203},4265]
["gesamteKärntenSpittal an der Drau",283,"gesamte","Kärnten","6 -Pol.Bez. Spittal an der Drau","Spittal an der Drau",4102,4076,4263,4296,4302,4374,4430,4517,4619,4756,{"$f":"Q150+Q17","v":4861},4983,5201,5313,5420,5452,5523,{"$f":"X150+X17","v":5579},5634,{"$f":"Z150+Z17","v":5769},5931,{"$f":"AB150+AB17","v":5977},6091,{"$f":"AD150+AD17","v":6260},6343]
["gesamteKärntenVillach-Land",284,"gesamte","Kärnten","7 -Pol.Bez. Villach-Land","Villach-Land",2895,2994,3092,3188,3257,3333,3396,3511,3592,3694,3772,3886,4016,4242,4357,4476,4548,{"$f":"X151+X18","v":4613},4626,{"$f":"Z151+Z18","v":4715},4813,{"$f":"AB151+AB18","v":4896},5095,{"$f":"AD151+AD18","v":5260},5305]
["gesamteKärntenVillach",285,"gesamte","Kärnten","8 -Statutarstadt Villach","Villach",3255,3368,3452,3488,3601,3659,3771,3899,4036,4073,4151,4250,4347,4441,4522,4559,4661,{"$f":"X152+X19","v":4710},4780,{"$f":"Z152+Z19","v":4902},4979,{"$f":"AB152+AB19","v":5049},5063,{"$f":"AD152+AD19","v":5148},5244]
["gesamteKärntenVölkermarkt",286,"gesamte","Kärnten","9 -Pol.Bez. Völkermarkt","Völkermarkt",1984,2023,2081,2114,2183,2172,2245,2278,2295,2327,2363,2419,2560,2700,2754,2802,2924,{"$f":"X153+X20","v":3000},2976,{"$f":"Z153+Z20","v":3035},3060,{"$f":"AB153+AB20","v":3076},3087,{"$f":"AD153+AD20","v":3135},3230]
["gesamteKärntenWolfsberg",287,"gesamte","Kärnten","10-Pol.Bez. Wolfsberg","Wolfsberg",2230,2270,2381,2427,2526,2569,2608,2677,2710,2738,2839,3082,3367,3495,3571,3874,3973,{"$f":"X154+X21","v":3937},3927,{"$f":"Z154+Z21","v":3995},4003,{"$f":"AB154+AB21","v":3850},3868,{"$f":"AD154+AD21","v":3919},4464]
[{"$error":"#N/A"},288,"gesamte","Niederösterreich","0 -im Bundesland gültig",{"$error":"#N/A"},0,0,0,106,28,0,7,2,7,13,22,10,1,0,0,0,0,{"$f":"X155+X22","v":0},0,{"$f":"Z155+Z22","v":0},0,{"$f":"AB155+AB22","v":0},0,{"$f":"AD155+AD22","v":0},0]
["gesamteNiederösterreichAmstetten",289,"gesamte","Niederösterreich","1 -Amstetten","Amstetten",4766,4891,5240,5408,5558,5756,5946,6410,6621,6829,7136,7508,7905,8279,8634,8848,9035,{"$f":"X156+X23","v":9114},9246,{"$f":"Z156+Z23","v":9442},9551,{"$f":"AB156+AB23","v":9452},9288,{"$f":"AD156+AD23","v":9361},9634]
["gesamteNiederösterreichBaden",290,"gesamte","Niederösterreich","2 -Baden","Baden",7282,7613,7929,8326,8741,8995,9218,9634,9928,10271,10483,10746,11169,11461,11722,11894,12022,{"$f":"X157+X24","v":12126},12368,{"$f":"Z157+Z24","v":12769},13083,{"$f":"AB157+AB24","v":13012},13047,{"$f":"AD157+AD24","v":13141},13302]
["gesamteNiederösterreichBruck an der Leitha",291,"gesamte","Niederösterreich","3 -Bruck/Leitha","Bruck an der Leitha",1692,1761,1851,1932,1970,2097,2224,2411,2542,2677,2798,2928,3004,3194,3362,3399,8847,{"$f":"X158+X25","v":9036},9340,{"$f":"Z158+Z25","v":9803},10225,{"$f":"AB158+AB25","v":10786},11106,{"$f":"AD158+AD25","v":11325},11590]
["gesamteNiederösterreichGänserndorf",292,"gesamte","Niederösterreich","4 -Gänserndorf","Gänserndorf",3634,3786,3979,4198,4436,4593,4738,5211,5470,5839,5993,6181,6363,6540,6720,6930,7114,{"$f":"X159+X26","v":7219},7323,{"$f":"Z159+Z26","v":7431},7657,{"$f":"AB159+AB26","v":7640},7649,{"$f":"AD159+AD26","v":7672},7836]
["gesamteNiederösterreichGmünd",293,"gesamte","Niederösterreich","5 -Gmünd","Gmünd",1897,1944,1967,1990,2008,2042,2058,2142,2169,2241,2315,2357,2444,2555,2646,2676,2719,{"$f":"X160+X27","v":2727},2721,{"$f":"Z160+Z27","v":2805},2918,{"$f":"AB160+AB27","v":2878},2838,{"$f":"AD160+AD27","v":2860},2896]
["gesamteNiederösterreichHollabrunn",294,"gesamte","Niederösterreich","6 -Hollabrunn","Hollabrunn",1899,1951,1990,2046,2116,2208,2284,2432,2520,2634,2761,2883,2989,3086,3263,3380,3503,{"$f":"X161+X28","v":3469},3493,{"$f":"Z161+Z28","v":3638},3712,{"$f":"AB161+AB28","v":3735},3683,{"$f":"AD161+AD28","v":3736},3781]
["gesamteNiederösterreichHorn",295,"gesamte","Niederösterreich","7 -Horn","Horn",1544,1573,1610,1650,1697,1743,1796,1912,1963,2064,2164,2278,2359,2478,2586,2650,2768,{"$f":"X162+X29","v":2795},2821,{"$f":"Z162+Z29","v":2844},2867,{"$f":"AB162+AB29","v":2917},2833,{"$f":"AD162+AD29","v":2791},2770]
["gesamteNiederösterreichKorneuburg",296,"gesamte","Niederösterreich","8 -Korneuburg","Korneuburg",3540,3660,3810,4002,4184,4323,4387,4661,4910,5109,5323,5563,5799,5975,6203,6414,7663,{"$f":"X163+X30","v":7789},7869,{"$f":"Z163+Z30","v":8124},8325,{"$f":"AB163+AB30","v":8357},8431,{"$f":"AD163+AD30","v":8454},8452]
["gesamteNiederösterreichKrems-Land",297,"gesamte","Niederösterreich","9 -Krems/Donau (Land)","Krems-Land",3823,3909,3996,4144,4208,4352,4479,4834,5115,5502,5619,5724,5902,6062,6181,6331,6463,{"$f":"X164+X31","v":6483},6602,{"$f":"Z164+Z31","v":6776},6768,{"$f":"AB164+AB31","v":6766},6599,{"$f":"AD164+AD31","v":6584},6673]
["gesamteNiederösterreichLilienfeld",298,"gesamte","Niederösterreich","10-Lilienfeld","Lilienfeld",1297,1327,1344,1368,1411,1444,1477,1563,1609,1658,1725,1817,1863,1919,1957,1985,2024,{"$f":"X165+X32","v":2053},2046,{"$f":"Z165+Z32","v":2095},2125,{"$f":"AB165+AB32","v":2110},2074,{"$f":"AD165+AD32","v":2079},2085]
["gesamteNiederösterreichMelk",299,"gesamte","Niederösterreich","11-Melk","Melk",3304,{"$f":"H166+H33","v":3440},3580,3655,3739,3846,3901,4197,4295,4441,4658,4855,5098,5298,5586,5808,6054,{"$f":"X166+X33","v":6101},6199,{"$f":"Z166+Z33","v":6378},6455,{"$f":"AB166+AB33","v":6472},6334,{"$f":"AD166+AD33","v":6400},6480]
["gesamteNiederösterreichMistelbach",300,"gesamte","Niederösterreich","12-Mistelbach","Mistelbach",2745,2858,3032,3162,3244,3322,3437,3799,4050,4252,4472,4711,4957,5215,5523,5662,5905,{"$f":"X167+X34","v":5989},6103,{"$f":"Z167+Z34","v":6190},6365,{"$f":"AB167+AB34","v":6298},6303,{"$f":"AD167+AD34","v":6294},6314]
["gesamteNiederösterreichMödling",301,"gesamte","Niederösterreich","13-Mödling","Mödling",7959,8326,8642,9006,9330,9513,9781,10329,10697,11120,11435,11791,12006,12203,12603,12683,12812,{"$f":"X168+X35","v":12848},13020,{"$f":"Z168+Z35","v":13233},13337,{"$f":"AB168+AB35","v":12930},12751,{"$f":"AD168+AD35","v":12830},12954]
["gesamteNiederösterreichNeunkirchen",302,"gesamte","Niederösterreich","14-Neunkirchen","Neunkirchen",4023,4100,4206,4299,4355,4484,4615,4915,5124,5244,5438,5661,5841,6058,6215,6343,6508,{"$f":"X169+X36","v":6531},6557,{"$f":"Z169+Z36","v":6705},6789,{"$f":"AB169+AB36","v":6753},6729,{"$f":"AD169+AD36","v":6831},6900]
["gesamteNiederösterreichSankt Pölten-Land",303,"gesamte","Niederösterreich","15-Sankt Pölten (Land)","Sankt Pölten-Land",7235,7488,7775,8088,8208,8370,8530,9047,9348,9794,10330,10765,11126,11522,11730,11957,14708,{"$f":"X170+X37","v":14832},15027,{"$f":"Z170+Z37","v":15488},15860,{"$f":"AB170+AB37","v":15949},16005,{"$f":"AD170+AD37","v":16221},16583]
["gesamteNiederösterreichScheibbs",304,"gesamte","Niederösterreich","16-Scheibbs","Scheibbs",1712,1744,1842,1910,1967,2020,2071,2148,2225,2309,2451,2529,2592,2697,2784,2860,2957,{"$f":"X171+X38","v":3035},3090,{"$f":"Z171+Z38","v":3249},3416,{"$f":"AB171+AB38","v":3448},3399,{"$f":"AD171+AD38","v":3494},3648]
["gesamteNiederösterreichTulln",305,"gesamte","Niederösterreich","17-Tulln","Tulln",3050,3160,3314,3455,3644,3780,3908,4218,4410,4674,4893,5167,5407,5594,5824,6048,8854,{"$f":"X172+X39","v":8977},9152,{"$f":"Z172+Z39","v":9381},9672,{"$f":"AB172+AB39","v":9642},9663,{"$f":"AD172+AD39","v":9759},9866]
["gesamteNiederösterreichWaidhofen an der Thaya",306,"gesamte","Niederösterreich","18-Waidhofen/Thaya","Waidhofen an der Thaya",1284,1305,1344,1351,1359,1358,1379,1411,1436,1498,1534,1575,1589,1624,1718,1744,1790,{"$f":"X173+X40","v":1784},1775,{"$f":"Z173+Z40","v":1807},1935,{"$f":"AB173+AB40","v":1970},2041,{"$f":"AD173+AD40","v":2111},2157]
["gesamteNiederösterreichWiener Neustadt-Land",307,"gesamte","Niederösterreich","19-Wiener Neustadt (Land)","Wiener Neustadt-Land",5765,5978,6252,6517,6725,6894,7122,7551,8038,8553,8967,9370,9608,10023,10549,10939,{"$f":"W174+W41","v":11251},{"$f":"X174+X41","v":11402},11412,{"$f":"Z174+Z41","v":11660},12013,{"$f":"AB174+AB41","v":11968},11893,{"$f":"AD174+AD41","v":11989},12173]
["gesamteNiederösterreichWien-Umgebung",308,"gesamte","Niederösterreich","20-Wien-Umgebung","Wien-Umgebung",6071,6373,6706,6992,7258,7466,7677,8174,8564,9089,9437,9956,10390,10825,11082,11412,0,{"$f":"X175+X42","v":0},0,{"$f":"Z175+Z42","v":0},0,{"$f":"AB175+AB42","v":0},0,{"$f":"AD175+AD42","v":0},0]
["gesamteNiederösterreichZwettl",309,"gesamte","Niederösterreich","21-Zwettl","Zwettl",2011,2036,2080,2097,2138,2176,2233,2314,2403,2463,2548,2650,2754,2836,2993,3135,3223,{"$f":"X176+X43","v":3240},3277,{"$f":"Z176+Z43","v":3208},3286,{"$f":"AB176+AB43","v":3211},3185,{"$f":"AD176+AD43","v":3182},3162]
[{"$error":"#N/A"},310,"gesamte","Niederösterreich","99-im Bundesland gültig",{"$error":"#N/A"},158,158,165,149,155,153,147,152,146,142,131,130,134,133,139,133,131,{"$f":"X177+X44","v":129},139,{"$f":"Z177+Z44","v":142},143,{"$f":"AB177+AB44","v":150},152,{"$f":"AD177+AD44","v":151},157]
[{"$error":"#N/A"},311,"gesamte","Oberösterreich","0 -im Bundesland gültig",{"$error":"#N/A"},0,2,0,95,21,0,2,1,0,0,0,0,0,1,0,0,0,{"$f":"X178+X45","v":0},0,{"$f":"Z178+Z45","v":0},0,{"$f":"AB178+AB45","v":0},0,{"$f":"AD178+AD45","v":0},1]
["gesamteOberösterreichLinz",312,"gesamte","Oberösterreich","1 -Statutarstadt Linz/Donau","Linz",10893,11131,11434,11707,11832,12011,12163,12820,13192,13539,13772,14036,14360,14713,14964,15243,15283,{"$f":"X179+X46","v":15342},15433,{"$f":"Z179+Z46","v":15774},16084,{"$f":"AB179+AB46","v":15940},15882,{"$f":"AD179+AD46","v":15869},16193]
["gesamteOberösterreichSteyr",313,"gesamte","Oberösterreich","2 -Statutarstadt Steyr","Steyr",2001,2078,2139,2155,2160,2164,2154,2309,2385,2434,2501,2488,2524,2595,2637,2633,2625,{"$f":"X180+X47","v":2594},2584,{"$f":"Z180+Z47","v":2665},2705,{"$f":"AB180+AB47","v":2643},2662,{"$f":"AD180+AD47","v":2513},2548]
["gesamteOberösterreichWels",314,"gesamte","Oberösterreich","3 -Statutarstadt Wels","Wels",3519,3580,3662,3645,3706,3769,3811,4529,4635,4700,4749,4806,4871,4858,4875,4896,{"$f":"W181+W48","v":4907},{"$f":"X181+X48","v":4904},4930,{"$f":"Z181+Z48","v":4884},4941,{"$f":"AB181+AB48","v":4982},4948,{"$f":"AD181+AD48","v":4969},4925]
["gesamteOberösterreichBraunau am Inn",315,"gesamte","Oberösterreich","4 -Pol.Bez. Braunau am Inn","Braunau am Inn",3835,{"$f":"H182+H49","v":4001},4048,4172,4306,4329,4417,4653,4831,5011,5175,5353,5535,5722,5833,6027,6140,{"$f":"X182+X49","v":6246},6351,{"$f":"Z182+Z49","v":6506},6701,{"$f":"AB182+AB49","v":6750},6757,{"$f":"AD182+AD49","v":6786},6970]
["gesamteOberösterreichEferding",316,"gesamte","Oberösterreich","5 -Pol.Bez. Eferding","Eferding",1315,1357,1429,1468,1498,1528,1569,1631,1711,1784,1858,1919,1957,1998,2047,2109,2130,{"$f":"X183+X50","v":2223},2272,{"$f":"Z183+Z50","v":2358},2431,{"$f":"AB183+AB50","v":2444},2449,{"$f":"AD183+AD50","v":2576},2609]
["gesamteOberösterreichFreistadt",317,"gesamte","Oberösterreich","6 -Pol.Bez. Freistadt","Freistadt",2196,2254,2369,2446,2545,2577,2704,2846,2985,3082,3163,3240,3357,3474,3617,3754,3878,{"$f":"X184+X51","v":3890},4013,{"$f":"Z184+Z51","v":4122},4293,{"$f":"AB184+AB51","v":4459},4432,{"$f":"AD184+AD51","v":4505},4598]
["gesamteOberösterreichGmunden",318,"gesamte","Oberösterreich","7 -Pol.Bez. Gmunden","Gmunden",5093,5247,5339,5481,5674,5746,5904,6140,6281,6425,6634,6777,6960,7147,7345,7525,7726,{"$f":"X185+X52","v":7792},7834,{"$f":"Z185+Z52","v":8044},8330,{"$f":"AB185+AB52","v":8476},8450,{"$f":"AD185+AD52","v":8513},8653]
["gesamteOberösterreichGrieskirchen",319,"gesamte","Oberösterreich","8 -Pol.Bez. Grieskirchen","Grieskirchen",2559,2645,2757,2797,2867,2894,2926,2996,3116,3242,3335,3435,3593,3742,3918,4007,4170,{"$f":"X186+X53","v":4227},4282,{"$f":"Z186+Z53","v":4394},4494,{"$f":"AB186+AB53","v":4615},4678,{"$f":"AD186+AD53","v":4767},4894]
["gesamteOberösterreichKirchdorf an der Krems",320,"gesamte","Oberösterreich","9 -Pol.Bez. Kirchdorf an der Krems","Kirchdorf an der Krems",2496,2573,2676,2733,2849,2916,2953,3030,3119,3233,3288,3344,3392,3522,3593,3666,3741,{"$f":"X187+X54","v":3780},3922,{"$f":"Z187+Z54","v":4012},4126,{"$f":"AB187+AB54","v":4166},4145,{"$f":"AD187+AD54","v":4225},4368]
["gesamteOberösterreichLinz-Land",321,"gesamte","Oberösterreich","10-Pol.Bez. Linz-Land","Linz-Land",6670,6944,7134,7389,7592,7723,7891,8366,8781,9057,9233,9358,9623,9956,10233,10291,10583,{"$f":"X188+X55","v":10655},10808,{"$f":"Z188+Z55","v":11209},11377,{"$f":"AB188+AB55","v":11343},11326,{"$f":"AD188+AD55","v":11461},11629]
["gesamteOberösterreichPerg",322,"gesamte","Oberösterreich","11-Pol.Bez. Perg","Perg",2242,2328,2472,2560,2671,2725,2812,2996,3072,3136,3243,3325,3510,3620,3796,3950,3996,{"$f":"X189+X56","v":4119},4110,{"$f":"Z189+Z56","v":4315},4543,{"$f":"AB189+AB56","v":4638},4723,{"$f":"AD189+AD56","v":4798},4846]
["gesamteOberösterreichRied im Innkreis",323,"gesamte","Oberösterreich","12-Pol.Bez. Ried im Innkreis","Ried im Innkreis",2454,2569,2700,2789,2847,2895,2934,3066,3157,3215,3230,3314,3380,3493,3619,3665,3708,{"$f":"X190+X57","v":3786},3836,{"$f":"Z190+Z57","v":4011},4100,{"$f":"AB190+AB57","v":4132},4190,{"$f":"AD190+AD57","v":4171},4299]
[{"$f":"C324&D324&F324","v":"gesamteOberösterreichRohrbach"},324,"gesamte","Oberösterreich","13-Pol.Bez. Rohrbach","Rohrbach",1888,1963,2060,2127,2169,2207,2270,2354,2416,2517,2592,2658,2774,2856,2984,3101,3245,{"$f":"X191+X58","v":3285},3364,{"$f":"Z191+Z58","v":3459},3541,{"$f":"AB191+AB58","v":3580},3619,{"$f":"AD191+AD58","v":3647},3715]
["gesamteOberösterreichSchärding",325,"gesamte","Oberösterreich","14-Pol.Bez. Schärding","Schärding",2016,2072,2176,2215,2304,2373,2445,2536,2622,2662,2703,2793,2863,2976,3130,3177,3305,{"$f":"X192+X59","v":3374},3392,{"$f":"Z192+Z59","v":3548},3673,{"$f":"AB192+AB59","v":3664},3706,{"$f":"AD192+AD59","v":3733},3866]
["gesamteOberösterreichSteyr-Land",326,"gesamte","Oberösterreich","15-Pol.Bez. Steyr-Land","Steyr-Land",2406,2483,2559,2661,2743,2825,2902,3037,3161,3262,3377,3441,3537,3591,3705,3846,3942,{"$f":"X193+X60","v":4001},4050,{"$f":"Z193+Z60","v":4127},4247,{"$f":"AB193+AB60","v":4302},4298,{"$f":"AD193+AD60","v":4388},4533]
["gesamteOberösterreichUrfahr-Umgebung",327,"gesamte","Oberösterreich","16-Pol.Bez. Urfahr-Umgebung","Urfahr-Umgebung",3044,3181,3339,3446,3562,3660,3731,4368,4631,4791,4923,5123,5296,5504,5646,5757,5947,{"$f":"X194+X61","v":6181},6293,{"$f":"Z194+Z61","v":6587},6714,{"$f":"AB194+AB61","v":6809},6804,{"$f":"AD194+AD61","v":6939},7100]
["gesamteOberösterreichVöcklabruck",328,"gesamte","Oberösterreich","17-Pol.Bez. Vöcklabruck","Vöcklabruck",5926,6117,6334,6518,6618,6705,6846,7535,7808,8088,8207,8533,8945,9217,9463,9787,10004,{"$f":"X195+X62","v":10004},10164,{"$f":"Z195+Z62","v":10489},10786,{"$f":"AB195+AB62","v":10952},10934,{"$f":"AD195+AD62","v":11114},11295]
["gesamteOberösterreichWels-Land",329,"gesamte","Oberösterreich","18-Pol.Bez. Wels-Land","Wels-Land",2897,3071,3160,3280,3404,3515,3603,3736,3930,4047,4197,4335,4574,4759,4920,5045,5177,{"$f":"X196+X63","v":5299},5444,{"$f":"Z196+Z63","v":5637},5801,{"$f":"AB196+AB63","v":5767},5862,{"$f":"AD196+AD63","v":5950},6092]
[{"$error":"#N/A"},330,"gesamte","Salzburg","0 -im Bundesland gültig",{"$error":"#N/A"},0,1,1,8,12,0,1,0,0,0,0,0,0,0,0,0,5,{"$f":"X197+X64","v":39},52,{"$f":"Z197+Z64","v":51},48,{"$f":"AB197+AB64","v":50},59,{"$f":"AD197+AD64","v":60},77]
["gesamteSalzburgSalzburg",331,"gesamte","Salzburg","1 -Stadt Salzburg","Salzburg",11285,{"$f":"H198+H65","v":11551},11733,11844,12051,12206,12307,12657,12933,13238,13543,13597,13823,14016,14107,14299,14316,{"$f":"X198+X65","v":14526},14662,{"$f":"Z198+Z65","v":14910},15035,{"$f":"AB198+AB65","v":15012},15029,{"$f":"AD198+AD65","v":15191},15320]
["gesamteSalzburgHallein",332,"gesamte","Salzburg","2 -Pol.Bez. Hallein","Hallein",3083,3145,3244,3321,3408,3437,3514,3593,3660,3768,3939,4046,4192,4292,4403,4419,4481,{"$f":"X199+X66","v":4569},4606,{"$f":"Z199+Z66","v":4720},4797,{"$f":"AB199+AB66","v":4847},4818,{"$f":"AD199+AD66","v":4827},4884]
["gesamteSalzburgSalzburg-Umgebung",333,"gesamte","Salzburg","3 -Pol.Bez. Salzburg-Umgebung","Salzburg-Umgebung",8481,8807,9168,9403,9567,9682,9823,10158,10415,10679,10897,11188,11514,11831,12209,12368,12519,{"$f":"X200+X67","v":12669},12776,{"$f":"Z200+Z67","v":13034},13322,{"$f":"AB200+AB67","v":13424},13581,{"$f":"AD200+AD67","v":13807},13956]
["gesamteSalzburgSankt Johann im Pongau",334,"gesamte","Salzburg","4 -Pol.Bez. Sankt Johann im Pongau","Sankt Johann im Pongau",{"$f":"G201+G68","v":4720},4810,4888,4946,5040,5103,5230,5289,5360,5468,5651,5842,5881,6039,6124,6202,6216,{"$f":"X201+X68","v":6276},6304,{"$f":"Z201+Z68","v":6417},6570,{"$f":"AB201+AB68","v":6616},6755,{"$f":"AD201+AD68","v":6791},6919]
["gesamteSalzburgTamsweg",335,"gesamte","Salzburg","5 -Pol.Bez. Tamsweg","Tamsweg",1075,1103,1123,1130,1124,1125,1150,1192,1182,1204,1224,1234,1265,1315,1366,{"$f":"V202+V69","v":1371},1407,{"$f":"X202+X69","v":1413},1435,{"$f":"Z202+Z69","v":1467},1501,{"$f":"AB202+AB69","v":1540},1576,{"$f":"AD202+AD69","v":1583},1626]
["gesamteSalzburgZell am See",336,"gesamte","Salzburg","6 -Pol.Bez. Zell am See","Zell am See",5198,5315,5470,5544,5643,5740,5805,5955,6030,6125,6249,6349,6513,6731,6923,{"$f":"V203+V70","v":7075},7179,{"$f":"X203+X70","v":7323},7444,{"$f":"Z203+Z70","v":7607},7803,{"$f":"AB203+AB70","v":7986},8090,{"$f":"AD203+AD70","v":8250},8399]
[{"$error":"#N/A"},337,"gesamte","Salzburg","10-unbekannt",{"$error":"#N/A"},0,0,0,1,0,0,0,0,0,0,0,0,0,0,0,{"$f":"V204+V71","v":0},0,{"$f":"X204+X71","v":0},0,{"$f":"Z204+Z71","v":0},0,{"$f":"AB204+AB71","v":0},0,{"$f":"AD204+AD71","v":0},0]
[{"$error":"#N/A"},338,"gesamte","Steiermark","0 -im Bundesland gültig",{"$error":"#N/A"},0,0,16,234,18,0,0,0,0,0,0,0,0,0,1,{"$f":"V205+V72","v":0},0,{"$f":"X205+X72","v":0},0,{"$f":"Z205+Z72","v":0},0,{"$f":"AB205+AB72","v":0},0,{"$f":"AD205+AD72","v":0},0]
["gesamteSteiermarkGraz",339,"gesamte","Steiermark","1 -Graz-Stadt","Graz",14744,15434,16022,16408,16907,17232,17627,18354,18839,19445,19915,20423,21020,21504,21898,{"$f":"V206+V73","v":21964},22455,{"$f":"X206+X73","v":22796},23009,{"$f":"Z206+Z73","v":23962},24742,{"$f":"AB206+AB73","v":24755},24779,{"$f":"AD206+AD73","v":25112},25566]
["gesamteSteiermarkBruck an der Mur",340,"gesamte","Steiermark","2 -Bruck an der Mur","Bruck an der Mur",2605,2666,2700,2724,2803,2793,2827,2924,3027,3071,3079,3425,0,0,0,{"$f":"V207+V74","v":0},0,{"$f":"X207+X74","v":0},0,{"$f":"Z207+Z74","v":0},0,{"$f":"AB207+AB74","v":0},0,{"$f":"AD207+AD74","v":0},0]
["gesamteSteiermarkDeutschlandsberg",341,"gesamte","Steiermark","3 -Deutschlandsberg","Deutschlandsberg",2713,2888,2977,3065,3143,3262,3344,3570,3675,3813,3836,3972,4215,4358,4522,{"$f":"V208+V75","v":4692},4787,{"$f":"X208+X75","v":4861},4904,{"$f":"Z208+Z75","v":5000},5047,{"$f":"AB208+AB75","v":4976},5012,{"$f":"AD208+AD75","v":5104},5152]
["gesamteSteiermarkFeldbach",342,"gesamte","Steiermark","4 -Feldbach","Feldbach",2607,2743,2820,2918,3029,3033,3098,3263,3328,3452,3588,3726,0,0,0,{"$f":"V209+V76","v":0},0,{"$f":"X209+X76","v":0},0,{"$f":"Z209+Z76","v":0},0,{"$f":"AB209+AB76","v":0},0,{"$f":"AD209+AD76","v":0},0]
["gesamteSteiermarkFürstenfeld",343,"gesamte","Steiermark","5 -Fürstenfeld","Fürstenfeld",1207,1249,1305,1316,1357,1393,1431,1486,1520,1558,1586,1640,0,0,0,{"$f":"V210+V77","v":0},0,{"$f":"X210+X77","v":0},0,{"$f":"Z210+Z77","v":0},0,{"$f":"AB210+AB77","v":0},0,{"$f":"AD210+AD77","v":0},0]
["gesamteSteiermarkGraz-Umgebung",344,"gesamte","Steiermark","6 -Graz-Umgebung","Graz-Umgebung",5989,6326,6727,7130,7485,7772,7999,8453,8824,9123,9488,9777,10123,10563,11033,{"$f":"V211+V78","v":11726},12258,{"$f":"X211+X78","v":12471},12783,{"$f":"Z211+Z78","v":13141},13555,{"$f":"AB211+AB78","v":13770},13899,{"$f":"AD211+AD78","v":13988},14057]
["gesamteSteiermarkHartberg",345,"gesamte","Steiermark","7 -Hartberg","Hartberg",2648,2813,2902,3009,3123,3224,3307,3485,3621,3842,4097,4260,0,0,0,{"$f":"V212+V79","v":0},0,{"$f":"X212+X79","v":0},0,{"$f":"Z212+Z79","v":0},0,{"$f":"AB212+AB79","v":0},0,{"$f":"AD212+AD79","v":0},0]
["gesamteSteiermarkJudenburg",346,"gesamte","Steiermark","8 -Judenburg","Judenburg",2049,2073,2121,2161,2205,2227,2278,2343,2371,2459,2508,0,0,0,0,{"$f":"V213+V80","v":0},0,{"$f":"X213+X80","v":0},0,{"$f":"Z213+Z80","v":0},0,{"$f":"AB213+AB80","v":0},0,{"$f":"AD213+AD80","v":0},0]
["gesamteSteiermarkLeibnitz",347,"gesamte","Steiermark","9 -Leibnitz","Leibnitz",3248,3392,3545,3701,3878,3959,4018,4221,4352,4528,{"$f":"Q214+Q81","v":4677},4806,5024,5309,5475,5687,5951,{"$f":"X214+X81","v":6112},6290,{"$f":"Z214+Z81","v":6690},6898,{"$f":"AB214+AB81","v":7000},7119,{"$f":"AD214+AD81","v":7265},7357]
["gesamteSteiermarkLeoben",348,"gesamte","Steiermark","10-Leoben","Leoben",2690,2755,2840,2917,2993,2996,3026,3120,3237,3424,3600,3742,3855,3864,3919,3939,4019,{"$f":"X215+X82","v":4021},4018,{"$f":"Z215+Z82","v":4066},4057,{"$f":"AB215+AB82","v":4004},4062,{"$f":"AD215+AD82","v":4122},4156]
["gesamteSteiermarkLiezen",349,"gesamte","Steiermark","11-Liezen","Liezen",2072,2105,2174,2188,2251,2300,2366,2490,2468,2575,2671,3658,3755,4022,4054,4130,4165,{"$f":"X216+X83","v":4115},4124,{"$f":"Z216+Z83","v":4183},4214,{"$f":"AB216+AB83","v":4129},4128,{"$f":"AD216+AD83","v":4254},4348]
["gesamteSteiermarkMürzzuschlag",350,"gesamte","Steiermark","12-Mürzzuschlag","Mürzzuschlag",1679,1739,1785,1797,1824,1839,1874,1892,1891,1949,1982,2003,0,0,0,0,0,{"$f":"X217+X84","v":0},0,{"$f":"Z217+Z84","v":0},0,{"$f":"AB217+AB84","v":0},0,{"$f":"AD217+AD84","v":0},0]
["gesamteSteiermarkMurau",351,"gesamte","Steiermark","13-Murau","Murau",1269,1305,1347,1372,1417,1435,1451,1496,1541,1571,1634,1685,1746,1803,1865,1907,1903,{"$f":"X218+X85","v":1943},1949,{"$f":"Z218+Z85","v":1991},2031,{"$f":"AB218+AB85","v":2045},2116,{"$f":"AD218+AD85","v":2164},2139]
["gesamteSteiermarkRadkersburg",352,"gesamte","Steiermark","14-Radkersburg","Radkersburg",983,1020,1052,1083,1161,1166,1173,1199,1205,1243,1258,1301,0,0,0,0,0,{"$f":"X219+X86","v":0},0,{"$f":"Z219+Z86","v":0},0,{"$f":"AB219+AB86","v":0},0,{"$f":"AD219+AD86","v":0},0]
["gesamteSteiermarkGröbming",353,"gesamte","Steiermark","15-Gröbming","Gröbming",1569,1591,1621,1636,1666,1684,1711,1762,1814,1860,1892,1911,1979,2031,2050,2089,2081,{"$f":"X220+X87","v":2095},2126,{"$f":"Z220+Z87","v":2156},2239,{"$f":"AB220+AB87","v":2243},2300,{"$f":"AD220+AD87","v":2339},2407]
["gesamteSteiermarkVoitsberg",354,"gesamte","Steiermark","16-Voitsberg","Voitsberg",2403,2530,2635,2699,2777,2790,2802,2914,3000,3166,3223,3382,3463,3487,3553,3642,3794,{"$f":"X221+X88","v":3857},3944,{"$f":"Z221+Z88","v":4085},4085,{"$f":"AB221+AB88","v":4120},4083,{"$f":"AD221+AD88","v":4166},4249]
["gesamteSteiermarkWeiz",355,"gesamte","Steiermark","17-Weiz","Weiz",3436,3586,3810,3920,4067,4194,4348,4466,4655,4796,4919,5090,5425,5665,5902,6159,6431,{"$f":"X222+X89","v":7008},7402,{"$f":"Z222+Z89","v":7906},8373,{"$f":"AB222+AB89","v":8562},8769,{"$f":"AD222+AD89","v":8887},9242]
["gesamteSteiermarkBad Aussee",356,"gesamte","Steiermark","18-Bad Aussee","Bad Aussee",716,747,771,797,802,837,849,866,875,890,911,0,0,0,0,0,0,{"$f":"X223+X90","v":0},0,{"$f":"Z223+Z90","v":0},0,{"$f":"AB223+AB90","v":0},0,{"$f":"AD223+AD90","v":0},0]
["gesamteSteiermarkKnittelfeld",357,"gesamte","Steiermark","19-Knittelfeld","Knittelfeld",1131,1165,1208,1231,1281,1295,1301,1356,1364,1386,1419,0,0,0,0,0,0,{"$f":"X224+X91","v":0},0,{"$f":"Z224+Z91","v":0},0,{"$f":"AB224+AB91","v":0},0,{"$f":"AD224+AD91","v":0},0]
["gesamteSteiermarkMariazell",358,"gesamte","Steiermark","20-Mariazell","Mariazell",341,340,344,353,348,349,349,356,359,352,352,0,0,0,0,0,0,{"$f":"X225+X92","v":0},0,{"$f":"Z225+Z92","v":0},0,{"$f":"AB225+AB92","v":0},0,{"$f":"AD225+AD92","v":0},0]
["gesamteSteiermarkMurtal",359,"gesamte","Steiermark","21-Murtal","Murtal",0,0,0,0,0,0,0,0,0,0,3953,4065,4428,4833,5160,5385,5646,{"$f":"X226+X93","v":5760},5845,{"$f":"Z226+Z93","v":6110},5919,{"$f":"AB226+AB93","v":5959},5929,{"$f":"AD226+AD93","v":6350},6074]
["gesamteSteiermarkBruck-Mürzzuschlag",360,"gesamte","Steiermark","22-Bruck-Mürzzuschlag","Bruck-Mürzzuschlag",0,0,0,0,0,0,0,0,0,0,0,5471,5582,5703,5896,5957,6084,{"$f":"X227+X94","v":6080},6155,{"$f":"Z227+Z94","v":6333},6418,{"$f":"AB227+AB94","v":6494},6502,{"$f":"AD227+AD94","v":6551},6680]
["gesamteSteiermarkHartberg-Fürstenfeld",361,"gesamte","Steiermark","23-Hartberg-Fürstenfeld","Hartberg-Fürstenfeld",0,0,0,0,0,0,0,0,0,0,0,5957,6165,6470,6608,6786,7125,{"$f":"X228+X95","v":7330},7496,{"$f":"Z228+Z95","v":7643},7919,{"$f":"AB228+AB95","v":8040},8090,{"$f":"AD228+AD95","v":8195},8141]
["gesamteSteiermarkSüdoststeiermark",362,"gesamte","Steiermark","24-Südoststeiermark","Südoststeiermark",0,0,0,0,0,0,0,0,0,0,0,5092,5238,5344,5508,5682,5871,{"$f":"X229+X96","v":5999},6089,{"$f":"Z229+Z96","v":6123},6258,{"$f":"AB229+AB96","v":6346},6379,{"$f":"AD229+AD96","v":6397},6465]
[{"$error":"#N/A"},363,"gesamte","Tirol","0 -im Bundesland gültig",{"$error":"#N/A"},{"$f":"G230+G97","v":50},{"$f":"H230+H97","v":58},53,167,101,47,45,50,50,25,10,11,12,10,19,10,9,{"$f":"X230+X97","v":9},12,{"$f":"Z230+Z97","v":16},11,{"$f":"AB230+AB97","v":10},5,{"$f":"AD230+AD97","v":7},1]
["gesamteTirolInnsbruck",364,"gesamte","Tirol","1 -Innsbruck Stadt","Innsbruck",7782,8091,8307,8431,8511,8548,8733,9019,9176,9277,9466,9749,9984,10108,10204,10372,10479,{"$f":"X231+X98","v":10575},10631,{"$f":"Z231+Z98","v":10642},10894,{"$f":"AB231+AB98","v":10932},10968,{"$f":"AD231+AD98","v":11079},11189]
["gesamteTirolImst",365,"gesamte","Tirol","2 -Pol.Bez. Imst","Imst",2844,2922,3013,3088,3177,3194,3224,3318,3413,3529,3595,3675,3809,3922,4010,4066,4156,{"$f":"X232+X99","v":4229},4297,{"$f":"Z232+Z99","v":4378},4518,{"$f":"AB232+AB99","v":4656},4697,{"$f":"AD232+AD99","v":4803},4868]
["gesamteTirolInnsbruck Land",366,"gesamte","Tirol","3 -Innsbruck Land","Innsbruck Land",8010,8285,8520,8714,8902,9091,9363,9714,10009,10378,10552,10757,11176,11211,11509,11852,12101,{"$f":"X233+X100","v":12059},12298,{"$f":"Z233+Z100","v":12545},12910,{"$f":"AB233+AB100","v":13132},13505,{"$f":"AD233+AD100","v":13754},14012]
["gesamteTirolKitzbühel",367,"gesamte","Tirol","4 -Pol.Bez. Kitzbühel","Kitzbühel",4294,4356,4553,4618,4690,4796,4881,4983,5090,5183,5283,5364,5492,5660,5780,5907,6008,{"$f":"X234+X101","v":6075},6179,{"$f":"Z234+Z101","v":6222},6357,{"$f":"AB234+AB101","v":6421},6524,{"$f":"AD234+AD101","v":6601},6732]
["gesamteTirolKufstein",368,"gesamte","Tirol","5 -Pol.Bez. Kufstein","Kufstein",5057,5240,5423,5648,5710,5872,6042,6185,6289,6420,6607,6734,6830,6933,7063,7263,7398,{"$f":"X235+X102","v":7473},7698,{"$f":"Z235+Z102","v":7994},8233,{"$f":"AB235+AB102","v":8330},8366,{"$f":"AD235+AD102","v":8522},8740]
["gesamteTirolLandeck",369,"gesamte","Tirol","6 -Pol.Bez. Landeck","Landeck",2562,2589,2660,2697,2739,2759,2825,2859,2909,2917,2962,3021,3124,3167,3221,3280,3325,{"$f":"X236+X103","v":3339},3396,{"$f":"Z236+Z103","v":3447},3479,{"$f":"AB236+AB103","v":3539},3661,{"$f":"AD236+AD103","v":3830},3905]
["gesamteTirolLienz",370,"gesamte","Tirol","7 -Pol.Bez. Lienz","Lienz",2226,2273,2344,2406,2438,2498,2559,2611,2667,2726,2760,2836,2928,3054,3181,3352,3473,{"$f":"X237+X104","v":3491},3523,{"$f":"Z237+Z104","v":3640},3744,{"$f":"AB237+AB104","v":3740},3708,{"$f":"AD237+AD104","v":3431},3433]
["gesamteTirolReutte",371,"gesamte","Tirol","8 -Pol.Bez. Reutte","Reutte",1809,1851,1868,1896,1906,1932,1977,2025,2102,2135,2173,2228,2273,2317,2377,2407,2489,{"$f":"X238+X105","v":2523},2549,{"$f":"Z238+Z105","v":2668},2787,{"$f":"AB238+AB105","v":2828},2923,{"$f":"AD238+AD105","v":3019},3062]
["gesamteTirolSchwaz",372,"gesamte","Tirol","9 -Pol.Bez. Schwaz","Schwaz",4314,4390,4515,4594,4627,4667,4737,4823,4928,5001,5042,5158,5230,5365,5432,5619,5714,{"$f":"X239+X106","v":5792},5888,{"$f":"Z239+Z106","v":5963},6258,{"$f":"AB239+AB106","v":6348},6464,{"$f":"AD239+AD106","v":6577},6702]
[{"$error":"#N/A"},373,"gesamte","Vorarlberg","0 -im Bundesland gültig",{"$error":"#N/A"},0,0,0,71,168,0,2,0,2,5,1,1,1,5,5,0,0,{"$f":"X240+X107","v":1},1,{"$f":"Z240+Z107","v":0},4,{"$f":"AB240+AB107","v":0},1,{"$f":"AD240+AD107","v":1},1]
["gesamteVorarlbergBludenz",374,"gesamte","Vorarlberg","1 -Pol.Bez. Bludenz","Bludenz",3326,3401,3437,3512,3494,3486,3488,3654,3729,3833,3934,4032,4174,4245,4364,4422,4485,{"$f":"X241+X108","v":4528},4608,{"$f":"Z241+Z108","v":4685},4812,{"$f":"AB241+AB108","v":4885},4984,{"$f":"AD241+AD108","v":5053},5259]
["gesamteVorarlbergBregenz",375,"gesamte","Vorarlberg","2 -Pol.Bez. Bregenz","Bregenz",6717,6870,6978,7123,7160,7209,7259,7557,7715,7859,8011,8163,8329,8638,8808,8928,9109,{"$f":"X242+X109","v":9281},9444,{"$f":"Z242+Z109","v":9680},9839,{"$f":"AB242+AB109","v":9944},10097,{"$f":"AD242+AD109","v":10201},10445]
["gesamteVorarlbergDornbirn",376,"gesamte","Vorarlberg","3 -Pol.Bez. Dornbirn","Dornbirn",4742,4850,4966,5064,5063,5086,5087,5311,5407,5553,5727,5879,5911,6045,6197,6184,6305,{"$f":"X243+X110","v":6357},6510,{"$f":"Z243+Z110","v":6591},6835,{"$f":"AB243+AB110","v":6892},6960,{"$f":"AD243+AD110","v":6957},7020]
["gesamteVorarlbergFeldkirch",377,"gesamte","Vorarlberg","4 -Pol.Bez. Feldkirch","Feldkirch",4910,5024,5129,5312,5333,5336,5337,5666,5847,5915,6079,6191,6405,6469,6605,6677,6769,{"$f":"X244+X111","v":6871},6945,{"$f":"Z244+Z111","v":7106},7248,{"$f":"AB244+AB111","v":7364},7448,{"$f":"AD244+AD111","v":7533},7585]
[{"$error":"#N/A"},378,"gesamte","Wien","0 -im Bundesland gültig",{"$error":"#N/A"},134,129,139,389,355,80,53,55,43,49,49,33,30,33,36,36,39,{"$f":"X245+X112","v":447},0,{"$f":"Z245+Z112","v":0},0,{"$f":"AB245+AB112","v":0},0,{"$f":"AD245+AD112","v":1},1]
["gesamteWienInnere Stadt",379,"gesamte","Wien","1 -I.     Bezirk","Innere Stadt",6853,{"$f":"H246+H113","v":6926},6988,7120,7197,7250,7436,7516,7615,7766,7926,8026,8257,8520,8672,8703,8931,{"$f":"X246+X113","v":9224},9531,{"$f":"Z246+Z113","v":9980},10306,{"$f":"AB246+AB113","v":10529},10670,{"$f":"AD246+AD113","v":10836},11023]
["gesamteWienLeopoldstadt",380,"gesamte","Wien","2 -II.    Bezirk","Leopoldstadt",5282,5367,5470,5795,6107,6297,6530,6760,6930,7188,7255,7413,7599,7556,7676,7852,7933,{"$f":"X247+X114","v":7982},8125,{"$f":"Z247+Z114","v":8363},8555,{"$f":"AB247+AB114","v":8737},8854,{"$f":"AD247+AD114","v":9060},9373]
["gesamteWienLandstraße",381,"gesamte","Wien","3 -III.   Bezirk","Landstraße",6232,6374,6540,6901,7161,7385,7746,8030,8197,8348,8454,8716,9003,9158,9431,9646,9669,{"$f":"X248+X115","v":9713},9812,{"$f":"Z248+Z115","v":10035},10216,{"$f":"AB248+AB115","v":10259},10372,{"$f":"AD248+AD115","v":10591},10849]
["gesamteWienWieden",382,"gesamte","Wien","4 -IV.    Bezirk","Wieden",3387,3414,3488,3603,3629,3717,3785,3919,4047,4119,4186,4222,4237,4322,4387,4541,5101,{"$f":"X249+X116","v":5158},5190,{"$f":"Z249+Z116","v":5240},5251,{"$f":"AB249+AB116","v":5112},5085,{"$f":"AD249+AD116","v":5191},5339]
["gesamteWienMargareten",383,"gesamte","Wien","5 -V.     Bezirk","Margareten",3411,3477,3585,3788,3973,4092,4174,4211,4333,4465,4476,4493,4602,4607,4663,4674,4642,{"$f":"X250+X117","v":4654},4670,{"$f":"Z250+Z117","v":4743},4770,{"$f":"AB250+AB117","v":4744},4721,{"$f":"AD250+AD117","v":4752},4836]
["gesamteWienMariahilf",384,"gesamte","Wien","6 -VI.    Bezirk","Mariahilf",3590,3590,3730,3845,3855,3916,3970,4028,4143,4272,4328,4397,4491,4625,4695,4743,4703,{"$f":"X251+X118","v":4731},4778,{"$f":"Z251+Z118","v":4883},4844,{"$f":"AB251+AB118","v":4860},4808,{"$f":"AD251+AD118","v":4873},4955]
["gesamteWienNeubau",385,"gesamte","Wien","7 -VII.   Bezirk","Neubau",3975,4082,4166,4294,4352,4499,4578,5206,5731,6135,6301,6531,6756,6889,6976,6777,6153,{"$f":"X252+X119","v":5907},5631,{"$f":"Z252+Z119","v":5626},5713,{"$f":"AB252+AB119","v":5703},5640,{"$f":"AD252+AD119","v":5715},5796]
["gesamteWienJosefstadt",386,"gesamte","Wien","8 -VIII.  Bezirk","Josefstadt",2479,2485,2558,2632,2700,2749,2755,2801,2860,2931,2995,3065,3130,3192,3321,3436,3338,{"$f":"X253+X120","v":3362},3315,{"$f":"Z253+Z120","v":3352},3340,{"$f":"AB253+AB120","v":3334},3373,{"$f":"AD253+AD120","v":3377},3405]
["gesamteWienAlsergrund",387,"gesamte","Wien","9 -IX.    Bezirk","Alsergrund",3837,3920,4001,4117,4227,4315,4323,4388,4444,4558,4541,4595,4702,4752,4909,5015,5017,{"$f":"X254+X121","v":5059},5125,{"$f":"Z254+Z121","v":5187},5231,{"$f":"AB254+AB121","v":5202},5197,{"$f":"AD254+AD121","v":5213},5296]
[{"$f":"C388&D388&F388","v":"gesamteWienFavoriten"},388,"gesamte","Wien","10-X.     Bezirk","Favoriten",6502,6638,6743,7224,7574,7938,8280,8511,8783,9172,9314,9450,9565,9489,9504,9666,9767,{"$f":"X255+X122","v":10062},10289,{"$f":"Z255+Z122","v":10568},10993,{"$f":"AB255+AB122","v":11311},11162,{"$f":"AD255+AD122","v":11441},11647]
["gesamteWienSimmering",389,"gesamte","Wien","11-XI.    Bezirk","Simmering",2960,3076,3191,3367,3502,3584,3702,3902,4021,4191,4259,4299,4289,4220,4243,4319,4385,{"$f":"X256+X123","v":4454},4488,{"$f":"Z256+Z123","v":4598},4746,{"$f":"AB256+AB123","v":4964},4987,{"$f":"AD256+AD123","v":5074},5214]
["gesamteWienMeidling",390,"gesamte","Wien","12-XII.   Bezirk","Meidling",4188,4281,4316,4584,4781,4982,5107,5415,5595,5662,5710,5777,5845,5838,5894,6419,7238,{"$f":"X257+X124","v":7589},7988,{"$f":"Z257+Z124","v":8145},8140,{"$f":"AB257+AB124","v":7982},7986,{"$f":"AD257+AD124","v":8097},8190]
["gesamteWienHietzing",391,"gesamte","Wien","13-XIII.  Bezirk","Hietzing",3093,3192,3265,3384,3458,3509,3531,3696,3888,3971,4033,4161,4304,4442,4597,4713,4791,{"$f":"X258+X125","v":4880},4862,{"$f":"Z258+Z125","v":4859},4961,{"$f":"AB258+AB125","v":5046},5022,{"$f":"AD258+AD125","v":5039},5066]
["gesamteWienPenzing",392,"gesamte","Wien","14-XIV.   Bezirk","Penzing",4012,4077,4182,4460,4645,4814,4938,5137,5340,5529,5537,5708,5784,5888,6005,6067,6097,{"$f":"X259+X126","v":6101},6186,{"$f":"Z259+Z126","v":6259},6254,{"$f":"AB259+AB126","v":6286},6368,{"$f":"AD259+AD126","v":6498},6677]
["gesamteWienRudolfsheim-Fünfhaus",393,"gesamte","Wien","15-XV.    Bezirk","Rudolfsheim-Fünfhaus",4285,4353,4428,4691,4916,5074,5190,5284,5343,5635,5670,5773,5885,5795,5848,5824,5788,{"$f":"X260+X127","v":5801},5832,{"$f":"Z260+Z127","v":5885},5849,{"$f":"AB260+AB127","v":5826},5827,{"$f":"AD260+AD127","v":5845},5936]
["gesamteWienOttakring",394,"gesamte","Wien","16-XVI.   Bezirk","Ottakring",4453,4540,4718,5042,5353,5586,5753,6070,6415,6606,6655,6818,6953,6935,7028,7006,{"$f":"W261+W128","v":6482},{"$f":"X261+X128","v":6495},6465,{"$f":"Z261+Z128","v":6521},6637,{"$f":"AB261+AB128","v":6611},6514,{"$f":"AD261+AD128","v":6468},6553]
["gesamteWienHernals",395,"gesamte","Wien","17-XVII.  Bezirk","Hernals",2963,{"$f":"H262+H129","v":3028},3074,3360,3552,3640,3758,3822,3825,3930,3899,3987,3974,3925,3993,3960,3946,{"$f":"X262+X129","v":4030},3981,{"$f":"Z262+Z129","v":4018},4047,{"$f":"AB262+AB129","v":3968},3919,{"$f":"AD262+AD129","v":3976},4053]
["gesamteWienWähring",396,"gesamte","Wien","18-XVIII. Bezirk","Währing",3146,3223,3308,3495,3575,3669,3732,3850,3918,4001,4073,4211,4246,4294,4293,4384,4474,{"$f":"X263+X130","v":4452},4575,{"$f":"Z263+Z130","v":4684},4822,{"$f":"AB263+AB130","v":4818},4858,{"$f":"AD263+AD130","v":4920},4957]
["gesamteWienDöbling",397,"gesamte","Wien","19-XIX.   Bezirk","Döbling",4195,4267,4322,4465,4649,4816,4885,5221,5574,5888,5948,6114,6399,6496,6630,6622,6676,{"$f":"X264+X131","v":6709},6738,{"$f":"Z264+Z131","v":6852},6948,{"$f":"AB264+AB131","v":6935},6939,{"$f":"AD264+AD131","v":6987},7080]
["gesamteWienBrigittenau",398,"gesamte","Wien","20-XX.    Bezirk","Brigittenau",{"$f":"G265+G132","v":3275},3340,3504,3717,3977,4130,4203,4303,4409,4567,4548,4612,4703,4621,4631,4668,4649,{"$f":"X265+X132","v":4603},4611,{"$f":"Z265+Z132","v":4642},4720,{"$f":"AB265+AB132","v":4685},4672,{"$f":"AD265+AD132","v":4791},4817]
["gesamteWienFloridsdorf",399,"gesamte","Wien","21-XXI.   Bezirk","Floridsdorf",5321,5523,5670,5928,6226,6412,6519,6693,6919,7037,7110,7241,7411,7398,7636,7847,8000,{"$f":"X266+X133","v":7968},8173,{"$f":"Z266+Z133","v":8429},8629,{"$f":"AB266+AB133","v":8812},8930,{"$f":"AD266+AD133","v":9171},9291]
["gesamteWienDonaustadt",400,"gesamte","Wien","22-XXII.  Bezirk","Donaustadt",5571,5852,6212,6721,6907,7128,7396,7678,7932,8158,8412,8641,8879,9189,9470,9788,10121,{"$f":"X267+X134","v":10404},10727,{"$f":"Z267+Z134","v":10885},11011,{"$f":"AB267+AB134","v":11281},11586,{"$f":"AD267+AD134","v":11941},12439]
["gesamteWienLiesing",401,"gesamte","Wien","23-XXIII. Bezirk","Liesing",{"$f":"G268+G135","v":5535},{"$f":"H268+H135","v":5575},5789,6019,6090,6248,6425,6644,6785,6945,7047,7196,7341,7456,7657,7867,8035,{"$f":"X268+X135","v":8253},8314,{"$f":"Z268+Z135","v":8530},8696,{"$f":"AB268+AB135","v":8865},8908,{"$f":"AD268+AD135","v":9103},{"$f":"AE268+AE135","v":9180}]

{"sheet":"Landkarte","index":6,"n_rows":12,"n_cols":5,"rows_kept":12,"cut":false,"hidden":true,"merged":[]}
[null,"Burgenland",1,{"$f":"Auswahl_Bundesland","v":"Burgenland"},{"$f":"IF(AND(Auswahl_Jahr<2012,Auswahl_Bundesland=\"Steiermark\"),10,IF(AND(Auswahl_Jahr=2012,Auswahl_Bundesland=\"Steiermark\"),11,IF(AND(Auswahl_Jahr>=2017,Auswahl_Bundesland=\"Niederösterreich\"),12,VLOOKUP(D1,B:C,2,FALSE))))","v":1}]
[null,"Kärnten",2]
[null,"Niederösterreich",3]
[null,"Oberösterreich",4]
[null,"Salzburg",5]
[null,"Steiermark",6]
[null,"Tirol",7]
[null,"Vorarlberg",8]
[null,"Wien",9]
[null,"Steiermark_2011",10]
[null,"Steiermark_2012",11]
[null,"Niederösterreich_2017",12]

{"sheet":"X_Y","index":7,"n_rows":123,"n_cols":3,"rows_kept":123,"cut":false,"hidden":true,"merged":[]}
["Bezirk","X","Y"]
["Eisenstadt-Umgebung",3.8,21500]
["Neusiedl am See",4.5,23000]
["Mattersburg",3.3,19300]
["Oberpullendorf",3.55,15000]
["Oberwart",3,10500]
["Güssing",3.1,5900]
["Jennersdorf",2.82,2500]
["Feldkirchen",4.4000000000000004,14500]
["Hermagor",1.3,10600]
["Klagenfurt-Land",5.2,6500]
["Klagenfurt am Wörthersee",5.3,11000]
["Sankt Veit an der Glan",5.5,17500]
["Spittal an der Drau",1.8,17500]
["Villach-Land",3.2,12000]
["Villach",3.75,9500]
["Völkermarkt",6.5,8500]
["Wolfsberg",7.1,16500]
["Amstetten",1.9,11500]
["Baden",4.5999999999999996,10000]
["Bruck an der Leitha",5.7,12000]
["Gänserndorf",5.7,15500]
["Gmünd",2.1,22000]
["Hollabrunn",4.4000000000000004,21000]
["Horn",3.6,23000]
["Korneuburg",4.8,18500]
["Krems-Land",3.4,18500]
["Lilienfeld",3.5,9000]
["Melk",2.8,14000]
["Mistelbach",5.2,22000]
["Mödling",4.8,12000]
["Neunkirchen",4.25,5000]
["Sankt Pölten-Land",3.75,14000]
["Scheibbs",2.7,9000]
["Tulln",4.2,16500]
["Waidhofen an der Thaya",3.05,25000]
["Wiener Neustadt-Land",4.4000000000000004,8000]
["Wien-Umgebung",4.5,14000]
["Zwettl",2.61,19500]
["Linz",4.5999999999999996,17500]
["Steyr",4.8499999999999996,12900]
["Wels",3.95,15000]
["Braunau am Inn",1.85,14000]
["Eferding",3.87,18000]
["Freistadt",5.3,21000]
["Gmunden",3.5,7500]
["Grieskirchen",3.4,16500]
["Kirchdorf an der Krems",4.5,7000]
["Linz-Land",4.5999999999999996,15000]
["Perg",5.5,16800]
["Ried im Innkreis",2.7,16000]
["Rohrbach",3.8,23000]
["Schärding",2.95,20000]
["Steyr-Land",5.15,9000]
["Urfahr-Umgebung",4.55,20500]
["Vöcklabruck",2.95,11000]
["Wels-Land",3.82,13000]
["Salzburg",4.0999999999999996,20500]
["Hallein",4.6500000000000004,17000]
["Salzburg-Umgebung",4.3,24000]
["Sankt Johann im Pongau",4.6500000000000004,11000]
["Tamsweg",5.6,7000]
["Zell am See",3.2,10000]
["Graz",5.65,10800]
["Bruck an der Mur",5,22000]
["Deutschlandsberg",5,5000]
["Feldbach",7,8000]
["Fürstenfeld",7.4,11500]
["Graz-Umgebung",5.25,14000]
["Hartberg",7.2,16000]
["Judenburg",2.85,14000]
["Leibnitz",6,4500]
["Leoben",4,19000]
["Liezen",1.8,20000]
["Mürzzuschlag",6,22000]
["Murau",1.7,13000]
["Radkersburg",7,4000]
["Gröbming",0.75,19500]
["Voitsberg",4.5,10800]
["Weiz",6.3,15000]
["Bad Aussee",0.5,22000]
["Knittelfeld",3.7,15000]
["Mariazell",5.25,26200]
["Murtal",3.2,14000]
["Bruck-Mürzzuschlag",5.3,22000]
["Hartberg-Fürstenfeld",7.2,15000]
["Südoststeiermark",7,6000]
["Innsbruck",3.67,16400]
["Imst",2.4,14000]
["Innsbruck Land",3.6,12000]
["Kitzbühel",6.3,20000]
["Kufstein",5.4,22000]
["Landeck",1.3,12000]
["Lienz",6.6,7000]
["Reutte",1.8,20000]
["Schwaz",5,14000]
["Bludenz",4.2,11000]
["Bregenz",4.5,19000]
["Dornbirn",3.65,20000]
["Feldkirch",3.3,16000]
["Innere Stadt",3.48,12500]
["Leopoldstadt",4.3499999999999996,12900]
["Landstraße",4,10500]
["Wieden",3.53,10300]
["Margareten",3.23,9300]
["Mariahilf",3.1,10300]
["Neubau",3.05,11300]
["Josefstadt",3.05,12800]
["Alsergrund",3.25,14500]
["Favoriten",4,5000]
["Simmering",5,6500]
["Meidling",2.6,6800]
["Hietzing",1.2,8000]
["Penzing",0.65,14500]
["Rudolfsheim-Fünfhaus",2.7,10600]
["Ottakring",2.2000000000000002,13000]
["Hernals",1.8,15500]
["Währing",2.4,16000]
["Döbling",2.7,19000]
["Brigittenau",3.62,16800]
["Floridsdorf",4.2,22000]
["Donaustadt",5.8,15000]
["Liesing",2.2000000000000002,3500]